program: Orca
programVersion: 5.0.2
elementType: S F F O O N C C C C C C C C C C C C C C C C C H H H H H H H H H H H H H H H H H
charge: 0
multiplicity: 1
keywords: wb97x-d3
keywords: def2-TZVPP
keywords: def2/J RIJCOSX
keywords: DEFGRID2
keywords: scfconv7
keywords: smallprint printgap noloewdin
keywords: NOSOSCF
formula: C17H17F2NO2S
InChI: InChI=1/C17H17F2NO2S/c1-11-6-7-23-16(11)15-8-17(2,22-20-15)10-21-9-12-13(18)4-3-5-14(12)19/h3-7H,8-10H2,1-2H3
40 atoms
S  2.774865 -0.15843 -0.573824
F  -0.564716 -1.990273 1.001436
F  -3.219286 -0.439266 -2.525777
O  -0.495849 2.788838 1.50973
O  -2.097736 0.653495 0.843999
N  0.500854 1.921523 1.861147
C  -0.870275 2.595267 0.122148
C  0.281064 1.761745 -0.439017
C  -2.194546 1.844519 0.097245
C  0.944453 1.319232 0.826942
C  -1.02539 3.948456 -0.540904
C  1.991645 0.326593 0.890544
C  2.49434 -0.351587 1.977916
C  -2.784079 -0.455623 0.305539
C  -1.935797 -1.177589 -0.709033
C  3.512771 -1.265074 1.594648
C  2.033642 -0.183458 3.388173
C  3.767737 -1.267692 0.257423
C  -0.813785 -1.895661 -0.311809
C  -2.149484 -1.11455 -2.077725
C  0.048116 -2.515713 -1.191104
C  -1.317793 -1.710278 -3.007526
C  -0.213921 -2.411873 -2.549769
H  0.968901 2.362227 -1.042986
H  -0.054819 0.929095 -1.059394
H  -2.453665 1.657328 -0.950749
H  -2.987395 2.479711 0.513893
H  -1.294947 3.821219 -1.590216
H  -1.807993 4.542281 -0.066406
H  -0.093827 4.513068 -0.502782
H  -3.742427 -0.161659 -0.130051
H  -3.017018 -1.120995 1.137931
H  4.031813 -1.901559 2.298354
H  0.947421 -0.239277 3.465794
H  2.459756 -0.958005 4.024132
H  2.329496 0.783302 3.797582
H  4.489705 -1.864846 -0.279161
H  0.906258 -3.061218 -0.821595
H  -1.530744 -1.625638 -4.064981
H  0.450943 -2.884737 -3.259884
elementType: S F O N C H
totalener: -1461.19162293 hartree
nucrepener: 2234.68096794 hartree
electener: -3695.87259087 hartree
oneelecener: -6447.94335125 hartree
twoeener: 2752.07076038 hartree
cpcmener: -0.02922209 hartree
kineticenergy: 1456.14384646 hartree
xcener: -118.605948032777 hartree
chargesum: -0.0000000
charge: 0.030956 -0.216795 -0.221161 -0.276956 -0.362168 -0.129063 0.322485 -0.129848 -0.095374 0.223988 -0.305689 -0.051879 -0.202820 0.045211 -0.190037 -0.129943 -0.220944 -0.194520 0.283498 0.364258 -0.247853 -0.226762 -0.092522 0.124498 0.097069 0.096051 0.107945 0.102560 0.103462 0.101533 0.107630 0.112114 0.151636 0.097191 0.096734 0.102150 0.160345 0.149699 0.149553 0.163766
qa: 0.0310 -0.2168 -0.2212 -0.2770 -0.3622 -0.1291 0.3225 -0.1298 -0.0954 0.2240 -0.3057 -0.0519 -0.2028 0.0452 -0.1900 -0.1299 -0.2209 -0.1945 0.2835 0.3643 -0.2479 -0.2268 -0.0925 0.1245 0.0971 0.0961 0.1079 0.1026 0.1035 0.1015 0.1076 0.1121 0.1516 0.0972 0.0967 0.1021 0.1603 0.1497 0.1496 0.1638
va: 2.7506 1.0691 1.0663 1.9700 1.9616 2.9506 3.8182 3.9283 4.0390 3.6012 3.9558 3.5920 3.8109 3.9053 3.5900 3.9044 3.9299 4.0158 3.8037 3.7539 3.9101 3.9507 3.8250 1.0109 1.0198 0.9938 1.0049 1.0006 1.0078 1.0072 1.0032 0.9972 1.0007 1.0075 1.0018 1.0011 0.9982 1.0006 1.0000 0.9852
dispcorr: -0.024095520 hartree
energy: -1461.215718446862
dipole: 2.87253 -2.63391 0.23862 8.82806 -9.84579 -1.01773 2.79244 -5.16921 -2.37677
magnitude: 2.59649 au
magnitude: 6.59975 debye
