program: Orca
programVersion: 5.0.2
elementType: S F F O O N C C C C C C C C C C C C C C C C C H H H H H H H H H H H H H H H H H
charge: 0
multiplicity: 1
keywords: wb97x-d3
keywords: def2-TZVPP
keywords: def2/J RIJCOSX
keywords: DEFGRID2
keywords: scfconv7
keywords: smallprint printgap noloewdin
keywords: NOSOSCF
formula: C17H17F2NO2S
InChI: InChI=1/C17H17F2NO2S/c1-11-6-7-23-16(11)15-8-17(2,22-20-15)10-21-9-12-13(18)4-3-5-14(12)19/h3-7H,8-10H2,1-2H3
40 atoms
S  3.115838 1.003781 -0.819671
F  -3.305494 -1.418908 1.107145
F  -0.585157 -0.565339 -2.606309
O  -1.207942 1.058767 1.410215
O  -2.308938 1.399337 -1.427859
N  -0.016027 0.400314 1.483789
C  -1.09104 2.231698 0.564898
C  0.240165 2.020664 -0.156483
C  -2.305522 2.303437 -0.353971
C  0.807722 0.885356 0.637423
C  -1.068412 3.45308 1.469991
C  2.138081 0.351149 0.448214
C  2.792791 -0.659248 1.117719
C  -2.932092 0.151038 -1.237886
C  -1.996878 -0.935614 -0.775694
C  4.087813 -0.883842 0.577829
C  2.253774 -1.426421 2.279491
C  4.393696 -0.067609 -0.467876
C  -2.220949 -1.691244 0.365059
C  -0.849167 -1.25736 -1.487516
C  -1.386179 -2.708519 0.781926
C  0.02893 -2.254678 -1.114303
C  -0.255233 -2.984901 0.029514
H  0.87309 2.909635 -0.115391
H  0.130659 1.747717 -1.208799
H  -2.320617 3.303318 -0.796269
H  -3.218337 2.209946 0.249021
H  -0.927485 4.362212 0.884387
H  -2.001916 3.553254 2.027081
H  -0.249943 3.390435 2.188842
H  -3.352376 -0.134455 -2.205769
H  -3.777342 0.239366 -0.550481
H  4.764233 -1.636121 0.960394
H  2.925131 -2.243426 2.54188
H  2.143852 -0.790522 3.160573
H  1.27058 -1.84702 2.07241
H  5.305671 -0.041672 -1.045169
H  -1.612222 -3.267286 1.680455
H  0.91061 -2.456991 -1.707902
H  0.414398 -3.775969 0.338858
elementType: S F O N C H
totalener: -1461.19104458 hartree
nucrepener: 2261.67664286 hartree
electener: -3722.86768745 hartree
oneelecener: -6502.47317440 hartree
twoeener: 2779.60548695 hartree
cpcmener: -0.02439666 hartree
kineticenergy: 1456.15099662 hartree
xcener: -118.611539164071 hartree
chargesum: -0.0000000
charge: 0.036726 -0.223399 -0.218719 -0.271043 -0.364897 -0.111093 0.290200 -0.160943 -0.013372 0.266371 -0.334419 -0.135325 -0.200102 0.027629 -0.143543 -0.131639 -0.233876 -0.192935 0.338730 0.313678 -0.210593 -0.250066 -0.139838 0.126841 0.121234 0.107873 0.097050 0.096336 0.106218 0.109795 0.119404 0.103083 0.150497 0.099875 0.109554 0.094518 0.162221 0.145660 0.144712 0.167600
qa: 0.0367 -0.2234 -0.2187 -0.2710 -0.3649 -0.1111 0.2902 -0.1609 -0.0134 0.2664 -0.3344 -0.1353 -0.2001 0.0276 -0.1435 -0.1316 -0.2339 -0.1929 0.3387 0.3137 -0.2106 -0.2501 -0.1398 0.1268 0.1212 0.1079 0.0971 0.0963 0.1062 0.1098 0.1194 0.1031 0.1505 0.0999 0.1096 0.0945 0.1622 0.1457 0.1447 0.1676
va: 2.7789 1.0634 1.0719 1.9692 1.9573 2.9148 3.7870 3.9360 3.9404 3.5086 3.9952 3.6096 3.7541 3.9335 3.5333 3.9266 3.9326 4.0383 3.7970 3.8018 3.8952 3.8857 3.7976 1.0110 1.0315 0.9978 1.0096 1.0054 1.0050 0.9997 0.9901 1.0112 1.0011 1.0036 0.9999 1.0049 0.9984 1.0008 1.0028 0.9834
dispcorr: -0.025570509 hartree
energy: -1461.216615090547
dipole: 4.55887 -3.64609 0.91278 6.89225 -6.63395 0.25830 9.10117 -9.21338 -0.11221
magnitude: 0.95524 au
magnitude: 2.42802 debye
