program: Orca
programVersion: 5.0.2
elementType: S F F O O N C C C C C C C C C C C C C C C C C H H H H H H H H H H H H H H H H H
charge: 0
multiplicity: 1
keywords: wb97x-d3
keywords: def2-TZVPP
keywords: def2/J RIJCOSX
keywords: DEFGRID2
keywords: scfconv7
keywords: smallprint printgap noloewdin
keywords: NOSOSCF
formula: C17H17F2NO2S
InChI: InChI=1/C17H17F2NO2S/c1-11-6-7-23-16(11)15-8-17(2,22-20-15)10-21-9-12-13(18)4-3-5-14(12)19/h3-7H,8-10H2,1-2H3
40 atoms
S  2.788961 -0.055462 -0.598572
F  -0.703417 -1.854347 1.12878
F  -3.010271 -0.499532 -2.711828
O  -0.587212 2.703372 1.565913
O  -2.229032 0.701711 0.766142
N  0.40583 1.82214 1.887579
C  -0.909193 2.61684 0.153651
C  0.246707 1.798422 -0.422753
C  -2.247183 1.90053 0.026238
C  0.881374 1.28856 0.830543
C  -1.002569 4.018849 -0.411634
C  1.933765 0.298518 0.861001
C  2.382986 -0.473656 1.9083
C  -2.859448 -0.40438 0.160124
C  -1.907735 -1.143649 -0.742519
C  3.421082 -1.352265 1.496018
C  1.858041 -0.4281 3.305035
C  3.742497 -1.235794 0.178143
C  -0.820341 -1.823756 -0.205899
C  -1.987578 -1.14259 -2.126844
C  0.132281 -2.466283 -0.966422
C  -1.064596 -1.771931 -2.941557
C  -0.00112 -2.431954 -2.347234
H  0.948641 2.417441 -0.990628
H  -0.083051 0.995342 -1.08448
H  -2.43842 1.728203 -1.039149
H  -3.052805 2.548846 0.394947
H  -1.248437 3.98154 -1.473798
H  -1.776099 4.60328 0.088657
H  -0.053149 4.544657 -0.308192
H  -3.760336 -0.108435 -0.383507
H  -3.190422 -1.061271 0.966452
H  3.906403 -2.049458 2.165496
H  2.222273 -1.279961 3.8781
H  2.172003 0.479163 3.823601
H  0.76815 -0.442001 3.330181
H  4.493661 -1.782523 -0.371867
H  0.960981 -2.975507 -0.492446
H  -1.177225 -1.743174 -4.017217
H  0.734515 -2.926489 -2.967064
elementType: S F O N C H
totalener: -1461.19120793 hartree
nucrepener: 2246.64342653 hartree
electener: -3707.83463446 hartree
oneelecener: -6471.85054066 hartree
twoeener: 2764.01590620 hartree
cpcmener: -0.02933786 hartree
kineticenergy: 1456.14995339 hartree
xcener: -118.607499030388 hartree
chargesum: -0.0000000
charge: 0.030939 -0.215773 -0.221167 -0.275894 -0.363563 -0.123472 0.316965 -0.135361 -0.086341 0.213586 -0.305803 -0.037349 -0.205923 0.047676 -0.201157 -0.137575 -0.221101 -0.190974 0.289996 0.367567 -0.246344 -0.226709 -0.094890 0.125401 0.099621 0.095835 0.106592 0.102816 0.102776 0.101477 0.105910 0.112709 0.151401 0.097638 0.104362 0.093577 0.159831 0.150288 0.149510 0.162925
qa: 0.0309 -0.2158 -0.2212 -0.2759 -0.3636 -0.1235 0.3170 -0.1354 -0.0863 0.2136 -0.3058 -0.0373 -0.2059 0.0477 -0.2012 -0.1376 -0.2211 -0.1910 0.2900 0.3676 -0.2463 -0.2267 -0.0949 0.1254 0.0996 0.0958 0.1066 0.1028 0.1028 0.1015 0.1059 0.1127 0.1514 0.0976 0.1044 0.0936 0.1598 0.1503 0.1495 0.1629
va: 2.7503 1.0721 1.0664 1.9720 1.9626 2.9502 3.8197 3.9315 4.0345 3.6129 3.9596 3.5824 3.8054 3.9087 3.5977 3.9072 3.9330 4.0170 3.7935 3.7547 3.9074 3.9514 3.8279 1.0096 1.0201 0.9939 1.0035 1.0008 1.0082 1.0065 1.0039 0.9967 1.0011 1.0010 1.0003 1.0106 0.9983 0.9995 0.9997 0.9857
dispcorr: -0.024797569 hartree
energy: -1461.216005499861
dipole: 2.76116 -2.38485 0.37631 8.43376 -9.36614 -0.93238 2.91013 -5.28694 -2.37681
magnitude: 2.58073 au
magnitude: 6.55969 debye
