program: Orca
programVersion: 5.0.2
elementType: S F F O O N C C C C C C C C C C C C C C C C C H H H H H H H H H H H H H H H H H
charge: 0
multiplicity: 1
keywords: wb97x-d3
keywords: def2-TZVPP
keywords: def2/J RIJCOSX
keywords: DEFGRID2
keywords: scfconv7
keywords: smallprint printgap noloewdin
keywords: NOSOSCF
formula: C17H17F2NO2S
InChI: InChI=1/C17H17F2NO2S/c1-11-6-7-23-16(11)15-8-17(2,22-20-15)10-21-9-12-13(18)4-3-5-14(12)19/h3-7H,8-10H2,1-2H3
40 atoms
S  2.770735 -0.055392 -0.601884
F  -0.71929 -1.877941 1.149539
F  -2.91615 -0.474661 -2.737139
O  -0.591841 2.716213 1.571103
O  -2.222042 0.704131 0.755996
N  0.395995 1.825651 1.88656
C  -0.91725 2.635858 0.158285
C  0.242635 1.827227 -0.424166
C  -2.251053 1.911602 0.029913
C  0.86855 1.298329 0.825102
C  -1.020079 4.041377 -0.397033
C  1.907779 0.293766 0.852549
C  2.330604 -0.501968 1.893542
C  -2.837887 -0.404388 0.138102
C  -1.868229 -1.142535 -0.746095
C  3.355343 -1.394799 1.478544
C  1.79386 -0.468593 3.286263
C  3.691891 -1.265962 0.165356
C  -0.800875 -1.836705 -0.187634
C  -1.912941 -1.129562 -2.131982
C  0.16455 -2.48307 -0.928547
C  -0.974367 -1.760055 -2.927858
C  0.067325 -2.435051 -2.311962
H  0.948175 2.456478 -0.976485
H  -0.082148 1.036207 -1.10252
H  -2.448274 1.750069 -1.036105
H  -3.05814 2.550715 0.411403
H  -1.798071 4.616682 0.106958
H  -0.074279 4.572551 -0.287436
H  -1.264009 4.010907 -1.459839
H  -3.729615 -0.111348 -0.422135
H  -3.181488 -1.062087 0.938508
H  3.819256 -2.111776 2.142231
H  0.704463 -0.435133 3.302938
H  2.116271 -1.349496 3.840366
H  2.142835 0.410771 3.830055
H  4.437763 -1.820023 -0.384449
H  0.975735 -3.006066 -0.439631
H  -1.057738 -1.721131 -4.005864
H  0.814373 -2.930603 -2.917156
elementType: S F O N C H
totalener: -1461.19102766 hartree
nucrepener: 2251.48220931 hartree
electener: -3712.67323697 hartree
oneelecener: -6481.53754521 hartree
twoeener: 2768.86430824 hartree
cpcmener: -0.02925622 hartree
kineticenergy: 1456.14703267 hartree
xcener: -118.607098021066 hartree
chargesum: 0.0000000
charge: 0.031340 -0.216104 -0.221139 -0.277004 -0.363771 -0.123588 0.315850 -0.136195 -0.085351 0.205486 -0.304451 -0.027624 -0.204584 0.048296 -0.207998 -0.141762 -0.222428 -0.188053 0.295586 0.369081 -0.245625 -0.224683 -0.098225 0.125897 0.100469 0.095118 0.106409 0.102815 0.101222 0.102782 0.105927 0.112057 0.151128 0.092788 0.097964 0.105223 0.159827 0.151199 0.149493 0.162626
qa: 0.0313 -0.2161 -0.2211 -0.2770 -0.3638 -0.1236 0.3159 -0.1362 -0.0854 0.2055 -0.3045 -0.0276 -0.2046 0.0483 -0.2080 -0.1418 -0.2224 -0.1881 0.2956 0.3691 -0.2456 -0.2247 -0.0982 0.1259 0.1005 0.0951 0.1064 0.1028 0.1012 0.1028 0.1059 0.1121 0.1511 0.0928 0.0980 0.1052 0.1598 0.1512 0.1495 0.1626
va: 2.7510 1.0715 1.0665 1.9710 1.9632 2.9486 3.8234 3.9307 4.0322 3.6286 3.9574 3.5903 3.7970 3.9074 3.6015 3.9084 3.9340 4.0143 3.7930 3.7533 3.9032 3.9513 3.8296 1.0096 1.0205 0.9949 1.0033 1.0082 1.0068 1.0009 1.0037 0.9972 1.0013 1.0116 1.0006 1.0000 0.9980 0.9992 0.9996 0.9860
dispcorr: -0.025032866 hartree
energy: -1461.216060526262
dipole: 2.49034 -2.12024 0.37010 8.38517 -9.31694 -0.93177 2.93669 -5.31487 -2.37819
magnitude: 2.58088 au
magnitude: 6.56008 debye
