program: Orca
programVersion: 5.0.2
elementType: S F F O O N C C C C C C C C C C C C C C C C C H H H H H H H H H H H H H H H H H
charge: 0
multiplicity: 1
keywords: wb97x-d3
keywords: def2-TZVPP
keywords: def2/J RIJCOSX
keywords: DEFGRID2
keywords: scfconv7
keywords: smallprint printgap noloewdin
keywords: NOSOSCF
formula: C17H17F2NO2S
InChI: InChI=1/C17H17F2NO2S/c1-11-6-7-23-16(11)15-8-17(2,22-20-15)10-21-9-12-13(18)4-3-5-14(12)19/h3-7H,8-10H2,1-2H3
40 atoms
S  3.211022 1.271511 -0.681346
F  -0.206019 -0.88994 -2.292184
F  -3.724793 -1.207219 0.774918
O  -1.194115 0.972015 1.336081
O  -1.990438 1.332106 -1.545957
N  -0.008923 0.304328 1.359227
C  -1.085214 2.200891 0.571505
C  0.323258 2.134653 -0.023895
C  -2.190037 2.222599 -0.476698
C  0.851989 0.893283 0.625661
C  -1.261051 3.36332 1.532622
C  2.197961 0.394535 0.417776
C  2.858997 -0.693271 0.943211
C  -2.708045 0.119804 -1.532879
C  -2.014156 -1.008164 -0.814403
C  4.183216 -0.793436 0.432556
C  2.335387 -1.672058 1.943719
C  4.507972 0.191144 -0.446885
C  -0.784373 -1.490864 -1.24138
C  -2.550436 -1.644274 0.29454
C  -0.132509 -2.555182 -0.652537
C  -1.94329 -2.709312 0.930815
C  -0.728784 -3.164643 0.441446
H  0.919695 3.012614 0.235228
H  0.32999 2.046019 -1.113093
H  -2.220239 3.230279 -0.902287
H  -3.158011 2.055223 0.01245
H  -1.154811 4.313573 1.008072
H  -2.245471 3.347693 2.003846
H  -0.506509 3.331717 2.319905
H  -2.847859 -0.16298 -2.57948
H  -3.71012 0.266932 -1.120569
H  4.866597 -1.581401 0.719581
H  2.827339 -1.527973 2.90859
H  1.265669 -1.584274 2.102046
H  2.553948 -2.693514 1.628498
H  5.442723 0.333456 -0.968382
H  0.818964 -2.89687 -1.038409
H  -2.4110 -3.170697 1.790758
H  -0.238794 -4.001274 0.921472
elementType: S F O N C H
totalener: -1461.18976466 hartree
nucrepener: 2249.19755333 hartree
electener: -3710.38731799 hartree
oneelecener: -6477.79910313 hartree
twoeener: 2767.41178514 hartree
cpcmener: -0.02433359 hartree
kineticenergy: 1456.14741333 hartree
xcener: -118.610206314300 hartree
chargesum: 0.0000000
charge: 0.033233 -0.221920 -0.223447 -0.265103 -0.367270 -0.112982 0.281584 -0.149616 -0.012736 0.242501 -0.327670 -0.070348 -0.218120 0.021069 -0.174762 -0.125725 -0.283080 -0.191345 0.337957 0.350462 -0.248875 -0.219061 -0.129594 0.121568 0.117134 0.111111 0.096169 0.098115 0.105313 0.107817 0.117817 0.103571 0.151348 0.120045 0.101099 0.108892 0.162127 0.147136 0.144929 0.160660
qa: 0.0332 -0.2219 -0.2234 -0.2651 -0.3673 -0.1130 0.2816 -0.1496 -0.0127 0.2425 -0.3277 -0.0703 -0.2181 0.0211 -0.1748 -0.1257 -0.2831 -0.1913 0.3380 0.3505 -0.2489 -0.2191 -0.1296 0.1216 0.1171 0.1111 0.0962 0.0981 0.1053 0.1078 0.1178 0.1036 0.1513 0.1200 0.1011 0.1089 0.1621 0.1471 0.1449 0.1607
va: 2.7709 1.0651 1.0617 1.9727 1.9496 2.9321 3.8258 3.9283 3.9329 3.5536 3.9934 3.5766 3.7561 3.9294 3.5442 3.9233 3.9313 4.0416 3.7821 3.7740 3.8988 3.9402 3.7988 1.0110 1.0315 0.9990 1.0100 1.0048 1.0052 1.0010 0.9922 1.0098 0.9983 0.9957 1.0228 0.9932 0.9984 1.0011 1.0011 0.9877
dispcorr: -0.024938299 hartree
energy: -1461.214702962583
dipole: 3.99777 -3.27425 0.72353 6.16811 -5.85841 0.30971 8.51779 -8.50080 0.01699
magnitude: 0.78721 au
magnitude: 2.00092 debye
