program: Orca
programVersion: 5.0.2
elementType: S F F O O N C C C C C C C C C C C C C C C C C H H H H H H H H H H H H H H H H H
charge: 0
multiplicity: 1
keywords: wb97x-d3
keywords: def2-TZVPP
keywords: def2/J RIJCOSX
keywords: DEFGRID2
keywords: scfconv7
keywords: smallprint printgap noloewdin
keywords: NOSOSCF
formula: C17H17F2NO2S
InChI: InChI=1/C17H17F2NO2S/c1-11-6-7-23-16(11)15-8-17(2,22-20-15)10-21-9-12-13(18)4-3-5-14(12)19/h3-7H,8-10H2,1-2H3
40 atoms
S  3.830214 2.116585 -1.11687
F  -1.961593 -2.431427 -2.482966
F  -3.336534 -1.30106 1.84656
O  0.041033 0.97467 1.729595
O  -0.928498 -0.107281 -0.714919
N  1.3692 0.717337 1.614801
C  -0.42332 1.825818 0.657815
C  0.839893 2.109174 -0.163498
C  -1.469702 1.045692 -0.132764
C  1.854978 1.314338 0.597867
C  -1.03102 3.073885 1.272654
C  3.250323 1.2163 0.236237
C  4.255488 0.48099 0.820915
C  -1.177546 -1.317508 -0.036341
C  -2.569834 -1.832459 -0.306752
C  5.490477 0.668353 0.147264
C  4.089328 -0.408932 2.008382
C  5.413249 1.520668 -0.910669
C  -2.91454 -2.34549 -1.552208
C  -3.596364 -1.786252 0.626277
C  -4.183349 -2.787425 -1.868121
C  -4.884467 -2.214525 0.363054
C  -5.169313 -2.713879 -0.896137
H  1.095628 3.172324 -0.185167
H  0.764282 1.768848 -1.198839
H  -1.846723 1.686519 -0.937478
H  -2.324437 0.824758 0.518369
H  -1.398539 3.747659 0.497145
H  -1.866354 2.82646 1.928851
H  -0.290221 3.614409 1.86223
H  -1.010868 -1.22503 1.037767
H  -0.442386 -2.02985 -0.411652
H  6.406146 0.178322 0.446941
H  3.755928 0.148958 2.883273
H  3.335555 -1.17589 1.830678
H  5.029181 -0.901709 2.253397
H  6.205191 1.823534 -1.576374
H  -4.390387 -3.180574 -2.853629
H  -5.641827 -2.153896 1.132153
H  -6.171031 -3.051762 -1.123318
totalener: -1461.17250218 hartree
nucrepener: 2069.79124834 hartree
electener: -3530.96375051 hartree
oneelecener: -6117.32391924 hartree
twoeener: 2586.36016873 hartree
kineticenergy: 1456.18752216 hartree
xcener: -118.610007373207 hartree
chargesum: 0.0000000
charge: 0.035707 -0.193664 -0.201269 -0.232758 -0.327265 -0.111512 0.222975 -0.157697 -0.024550 0.269547 -0.299902 -0.081532 -0.191443 0.071605 -0.220782 -0.105888 -0.181498 -0.171202 0.261496 0.319041 -0.209750 -0.197240 -0.076020 0.103395 0.113095 0.099163 0.089370 0.086471 0.098372 0.100150 0.120129 0.099593 0.115033 0.098744 0.096738 0.077101 0.124246 0.125312 0.125529 0.131160
qa: 0.0357 -0.1937 -0.2013 -0.2328 -0.3273 -0.1115 0.2230 -0.1577 -0.0246 0.2695 -0.2999 -0.0815 -0.1914 0.0716 -0.2208 -0.1059 -0.1815 -0.1712 0.2615 0.3190 -0.2097 -0.1972 -0.0760 0.1034 0.1131 0.0992 0.0894 0.0865 0.0984 0.1001 0.1201 0.0996 0.1150 0.0987 0.0967 0.0771 0.1242 0.1253 0.1255 0.1312
va: 2.7771 1.1087 1.0899 2.0290 1.9836 2.9310 3.9191 3.9176 3.9380 3.5323 3.9803 3.6921 3.9030 3.8596 3.6007 3.9647 3.9362 4.0496 3.9716 3.8228 3.9692 3.9731 3.8733 1.0103 1.0238 1.0016 1.0045 1.0051 1.0098 1.0062 1.0095 0.9970 1.0106 1.0070 1.0073 1.0029 1.0101 1.0089 1.0090 0.9970
dispcorr: -0.019283220 hartree
energy: -1461.191785397616
dipole: 5.85958 -6.40361 -0.54403 9.06308 -8.73745 0.32563 6.05996 -6.54748 -0.48752
magnitude: 0.79980 au
magnitude: 2.03292 debye
