program: Orca
programVersion: 5.0.2
elementType: S F F O O N C C C C C C C C C C C C C C C C C H H H H H H H H H H H H H H H H H
charge: 0
multiplicity: 1
keywords: wb97x-d3
keywords: def2-TZVPP
keywords: def2/J RIJCOSX
keywords: DEFGRID2
keywords: scfconv7
keywords: smallprint printgap noloewdin
keywords: NOSOSCF
formula: C17H17F2NO2S
InChI: InChI=1/C17H17F2NO2S/c1-11-6-7-23-16(11)15-8-17(2,22-20-15)10-21-9-12-13(18)4-3-5-14(12)19/h3-7H,8-10H2,1-2H3
40 atoms
S  3.6149 0.913964 -0.907226
F  -4.833201 -1.451541 0.311327
F  -1.213041 -1.069594 -2.625457
O  -0.136804 1.472181 2.149664
O  -2.111943 1.040242 -0.821338
N  1.196509 1.207519 2.183121
C  -0.5694 1.761392 0.802967
C  0.64576 1.414784 -0.06288
C  -1.756878 0.851246 0.52293
C  1.675204 1.176815 1.000582
C  -0.938588 3.232776 0.722811
C  3.069912 0.913127 0.731143
C  4.09835 0.643338 1.604596
C  -3.229242 0.310134 -1.247009
C  -3.032059 -1.182829 -1.160927
C  5.321748 0.441463 0.914334
C  3.967003 0.568104 3.090344
C  5.213373 0.557309 -0.437174
C  -3.8260 -2.004516 -0.374017
C  -2.003458 -1.815633 -1.849068
C  -3.632077 -3.368536 -0.263812
C  -1.762921 -3.172414 -1.771303
C  -2.588974 -3.944942 -0.968725
H  0.922202 2.227068 -0.738654
H  0.499711 0.525118 -0.681925
H  -2.591323 1.095348 1.197019
H  -1.467939 -0.189295 0.725328
H  -1.275988 3.490465 -0.280374
H  -1.737792 3.474197 1.424667
H  -0.078098 3.858195 0.96462
H  -3.40083 0.601344 -2.284636
H  -4.122852 0.596093 -0.682067
H  6.252363 0.217716 1.416799
H  3.235213 -0.181788 3.390009
H  4.922966 0.317618 3.54829
H  3.623156 1.513715 3.509631
H  5.991738 0.449801 -1.175351
H  -4.283373 -3.958879 0.365473
H  -0.946412 -3.610874 -2.32789
H  -2.416898 -5.00975 -0.893496
totalener: -1461.17325804 hartree
nucrepener: 2071.44796690 hartree
electener: -3532.62122494 hartree
oneelecener: -6120.26910925 hartree
twoeener: 2587.64788432 hartree
kineticenergy: 1456.18637541 hartree
xcener: -118.609127657740 hartree
chargesum: -0.0000000
charge: 0.038943 -0.203015 -0.192873 -0.223035 -0.307955 -0.100488 0.262208 -0.172017 -0.051822 0.250836 -0.306946 -0.085226 -0.188636 0.048295 -0.212861 -0.105443 -0.181962 -0.172070 0.337227 0.250933 -0.199814 -0.195921 -0.074424 0.100169 0.110982 0.095295 0.094653 0.095984 0.088519 0.100768 0.103861 0.096471 0.115044 0.098011 0.076813 0.098919 0.123643 0.125950 0.128037 0.132945
qa: 0.0389 -0.2030 -0.1929 -0.2230 -0.3080 -0.1005 0.2622 -0.1720 -0.0518 0.2508 -0.3069 -0.0852 -0.1886 0.0483 -0.2129 -0.1054 -0.1820 -0.1721 0.3372 0.2509 -0.1998 -0.1959 -0.0744 0.1002 0.1110 0.0953 0.0947 0.0960 0.0885 0.1008 0.1039 0.0965 0.1150 0.0980 0.0768 0.0989 0.1236 0.1259 0.1280 0.1329
va: 2.7784 1.0902 1.1064 2.0445 1.9849 2.9661 3.9343 3.9576 3.9945 3.5338 3.9814 3.6763 3.9011 3.9245 3.5603 3.9607 3.9369 4.0489 3.8428 3.9554 3.9734 3.9752 3.8755 1.0108 1.0226 1.0018 0.9998 1.0154 1.0121 1.0039 0.9913 1.0116 1.0105 1.0071 1.0027 1.0066 1.0103 1.0085 1.0082 0.9966
dispcorr: -0.019209184 hartree
energy: -1461.192467220022
dipole: 8.70477 -8.75880 -0.05403 7.41302 -8.17432 -0.76130 9.15911 -9.89197 -0.73285
magnitude: 1.05810 au
magnitude: 2.68947 debye
