program: Orca
programVersion: 5.0.2
elementType: S F F O O N C C C C C C C C C C C C C C C C C H H H H H H H H H H H H H H H H H
charge: 0
multiplicity: 1
keywords: wb97x-d3
keywords: def2-TZVPP
keywords: def2/J RIJCOSX
keywords: DEFGRID2
keywords: scfconv7
keywords: smallprint printgap noloewdin
keywords: NOSOSCF
formula: C17H17F2NO2S
InChI: InChI=1/C17H17F2NO2S/c1-11-6-7-23-16(11)15-8-17(2,22-20-15)10-21-9-12-13(18)4-3-5-14(12)19/h3-7H,8-10H2,1-2H3
40 atoms
S  3.469218 0.738601 -1.163374
F  -1.252454 -0.992767 -2.410364
F  -4.836547 -1.523268 0.553794
O  -0.012976 1.589559 2.13582
O  -2.207454 1.093291 -0.667106
N  1.305674 1.263085 2.081678
C  -0.535488 1.840329 0.813173
C  0.603547 1.429514 -0.125287
C  -1.760987 0.949793 0.654987
C  1.69468 1.174523 0.869483
C  -0.873787 3.317019 0.703246
C  3.053475 0.841403 0.50923
C  4.13685 0.578075 1.315219
C  -3.316897 0.310383 -1.009854
C  -3.053678 -1.17404 -0.926543
C  5.295771 0.294928 0.546219
C  4.116698 0.585923 2.808481
C  5.085908 0.34339 -0.79763
C  -2.009562 -1.76722 -1.627492
C  -3.811256 -2.030387 -0.140038
C  -1.7178 -3.114288 -1.557487
C  -3.564731 -3.386426 -0.036767
C  -2.50702 -3.92102 -0.751907
H  0.864082 2.21739 -0.83565
H  0.382482 0.535869 -0.714651
H  -2.53974 1.241617 1.375088
H  -1.480217 -0.088231 0.880302
H  -1.601318 3.609346 1.460928
H  0.019965 3.926577 0.842119
H  -1.291323 3.544216 -0.276785
H  -3.569383 0.582029 -2.036483
H  -4.183443 0.563829 -0.389849
H  6.254769 0.062922 0.987829
H  3.400871 -0.135377 3.202283
H  5.101198 0.345591 3.207597
H  3.815438 1.557899 3.199079
H  5.800269 0.16829 -1.585908
H  -0.890554 -3.518702 -2.123815
H  -4.189655 -4.002619 0.594466
H  -2.294867 -4.978904 -0.682626
totalener: -1461.17291901 hartree
nucrepener: 2079.51839205 hartree
electener: -3540.69131106 hartree
oneelecener: -6136.41401905 hartree
twoeener: 2595.72270798 hartree
kineticenergy: 1456.18489070 hartree
xcener: -118.608969381375 hartree
chargesum: 0.0000000
charge: 0.038402 -0.193126 -0.202965 -0.223265 -0.307773 -0.101448 0.267320 -0.175695 -0.060606 0.251573 -0.306665 -0.084492 -0.189193 0.050520 -0.198505 -0.105941 -0.181861 -0.171183 0.241051 0.329785 -0.192226 -0.198211 -0.077554 0.100901 0.112911 0.094613 0.097814 0.088821 0.099845 0.097184 0.103318 0.096909 0.115156 0.098033 0.076924 0.098461 0.123662 0.128603 0.125785 0.133119
qa: 0.0384 -0.1931 -0.2030 -0.2233 -0.3078 -0.1014 0.2673 -0.1757 -0.0606 0.2516 -0.3067 -0.0845 -0.1892 0.0505 -0.1985 -0.1059 -0.1819 -0.1712 0.2411 0.3298 -0.1922 -0.1982 -0.0776 0.1009 0.1129 0.0946 0.0978 0.0888 0.0998 0.0972 0.1033 0.0969 0.1152 0.0980 0.0769 0.0985 0.1237 0.1286 0.1258 0.1331
va: 2.7785 1.1065 1.0907 2.0449 1.9856 2.9672 3.9212 3.9597 4.0072 3.5363 3.9811 3.6760 3.9012 3.9250 3.5531 3.9606 3.9367 4.0486 3.9596 3.8550 3.9765 3.9691 3.8788 1.0109 1.0222 1.0023 0.9982 1.0123 1.0040 1.0149 0.9910 1.0119 1.0105 1.0070 1.0026 1.0071 1.0104 1.0081 1.0085 0.9966
dispcorr: -0.019352986 hartree
energy: -1461.192271995692
dipole: 9.22718 -9.31433 -0.08715 7.74896 -8.54149 -0.79253 8.35873 -9.08818 -0.72945
magnitude: 1.08065 au
magnitude: 2.74679 debye
