program: Orca
programVersion: 5.0.2
elementType: S F F O O N C C C C C C C C C C C C C C C C C H H H H H H H H H H H H H H H H H
charge: 0
multiplicity: 1
keywords: wb97x-d3
keywords: def2-TZVPP
keywords: def2/J RIJCOSX
keywords: DEFGRID2
keywords: scfconv7
keywords: smallprint printgap noloewdin
keywords: NOSOSCF
formula: C17H17F2NO2S
InChI: InChI=1/C17H17F2NO2S/c1-11-6-7-23-16(11)15-8-17(2,22-20-15)10-21-9-12-13(18)4-3-5-14(12)19/h3-7H,8-10H2,1-2H3
40 atoms
S  3.609703 0.892619 -1.077486
F  -1.859585 -1.243878 -2.98105
F  -4.263885 -1.32439 1.02819
O  -0.009434 1.608292 2.106291
O  -2.07277 0.993803 -0.777504
N  1.30194 1.255959 2.08838
C  -0.501533 1.850474 0.769139
C  0.711435 1.594857 -0.131895
C  -1.613987 0.834935 0.539587
C  1.746164 1.239273 0.89253
C  -1.005581 3.280129 0.695008
C  3.118178 0.915246 0.577236
C  4.163273 0.610482 1.418702
C  -3.245933 0.287566 -1.081855
C  -3.079033 -1.207751 -0.987917
C  5.355724 0.36165 0.690418
C  4.075915 0.545347 2.90816
C  5.207841 0.476331 -0.657443
C  -2.358082 -1.916336 -1.941122
C  -3.576966 -1.956048 0.069538
C  -2.146153 -3.278655 -1.873817
C  -3.393905 -3.320644 0.187179
C  -2.672093 -3.975297 -0.796796
H  1.000641 2.477481 -0.708459
H  0.550439 0.787357 -0.850477
H  -2.420567 1.000668 1.268291
H  -1.221441 -0.17725 0.711468
H  -1.381092 3.503635 -0.302575
H  -1.813085 3.449658 1.408284
H  -0.20247 3.981762 0.922782
H  -3.50991 0.566985 -2.102082
H  -4.072157 0.607253 -0.437717
H  6.29349 0.106361 1.163666
H  5.048439 0.31435 3.340594
H  3.72637 1.487176 3.330451
H  3.366625 -0.215674 3.233476
H  5.957753 0.338987 -1.419631
H  -1.581211 -3.778419 -2.648172
H  -3.805977 -3.851542 1.033816
H  -2.515278 -5.042528 -0.723445
totalener: -1461.17390268 hartree
nucrepener: 2063.89151708 hartree
electener: -3525.06541976 hartree
oneelecener: -6105.15494373 hartree
twoeener: 2580.08952397 hartree
kineticenergy: 1456.18961997 hartree
xcener: -118.609379816094 hartree
chargesum: 0.0000000
charge: 0.038724 -0.195896 -0.201361 -0.220894 -0.314463 -0.103592 0.261169 -0.168285 -0.056668 0.254745 -0.303909 -0.088300 -0.189919 0.056024 -0.234543 -0.105556 -0.181562 -0.171922 0.275774 0.337503 -0.206542 -0.193861 -0.072029 0.101124 0.112376 0.098612 0.093971 0.097432 0.088965 0.098146 0.098613 0.096999 0.115162 0.077063 0.097657 0.098538 0.123673 0.126956 0.127210 0.132867
qa: 0.0387 -0.1959 -0.2014 -0.2209 -0.3145 -0.1036 0.2612 -0.1683 -0.0567 0.2547 -0.3039 -0.0883 -0.1899 0.0560 -0.2345 -0.1056 -0.1816 -0.1719 0.2758 0.3375 -0.2065 -0.1939 -0.0720 0.1011 0.1124 0.0986 0.0940 0.0974 0.0890 0.0981 0.0986 0.0970 0.1152 0.0771 0.0977 0.0985 0.1237 0.1270 0.1272 0.1329
va: 2.7780 1.1042 1.0910 2.0461 1.9822 2.9690 3.9533 3.9463 4.0119 3.5325 3.9695 3.6798 3.9024 3.9179 3.5678 3.9620 3.9374 4.0493 3.9433 3.8242 3.9729 3.9788 3.8745 1.0107 1.0204 1.0033 1.0001 1.0144 1.0121 1.0059 0.9948 1.0067 1.0105 1.0027 1.0078 1.0063 1.0103 1.0083 1.0084 0.9966
dispcorr: -0.018960505 hartree
energy: -1461.192863182839
dipole: 8.87177 -8.96114 -0.08937 7.58232 -8.33073 -0.74842 8.58382 -9.26706 -0.68324
magnitude: 1.01732 au
magnitude: 2.58581 debye
