program: Orca
programVersion: 5.0.2
elementType: S F F O O N C C C C C C C C C C C C C C C C C H H H H H H H H H H H H H H H H H
charge: 0
multiplicity: 1
keywords: wb97x-d3
keywords: def2-TZVPP
keywords: def2/J RIJCOSX
keywords: DEFGRID2
keywords: scfconv7
keywords: smallprint printgap noloewdin
keywords: NOSOSCF
formula: C17H17F2NO2S
InChI: InChI=1/C17H17F2NO2S/c1-11-6-7-23-16(11)15-8-17(2,22-20-15)10-21-9-12-13(18)4-3-5-14(12)19/h3-7H,8-10H2,1-2H3
40 atoms
S  3.363802 0.503405 -1.103927
F  -1.587331 -0.836783 -2.76304
F  -4.349796 -1.644912 0.921556
O  -0.072919 1.726786 2.127065
O  -2.301041 1.131614 -0.632255
N  1.221022 1.315807 2.093569
C  -0.591598 1.91616 0.791858
C  0.549734 1.463003 -0.125024
C  -1.810014 1.010142 0.676053
C  1.612651 1.164847 0.888514
C  -0.93944 3.383411 0.615858
C  2.953939 0.744605 0.555358
C  4.024866 0.493179 1.38162
C  -3.380146 0.288957 -0.935396
C  -2.996243 -1.169357 -0.92821
C  5.170171 0.105657 0.638185
C  4.00612 0.611003 2.870172
C  4.96228 0.067003 -0.706256
C  -2.079279 -1.671561 -1.843943
C  -3.474925 -2.076362 0.005891
C  -1.657353 -2.985118 -1.851062
C  -3.088417 -3.402986 0.042166
C  -2.172149 -3.848347 -0.8956
H  0.859023 2.241566 -0.826387
H  0.299549 0.583115 -0.72387
H  -2.570089 1.299693 1.416309
H  -1.507169 -0.021526 0.90415
H  -1.339601 3.567108 -0.380199
H  -1.684106 3.700716 1.346255
H  -0.05276 4.004621 0.746985
H  -3.719404 0.577899 -1.931147
H  -4.218003 0.456874 -0.250468
H  6.118519 -0.134504 1.098075
H  3.282656 -0.071257 3.316212
H  4.988173 0.389333 3.285738
H  3.716122 1.612336 3.188341
H  5.668525 -0.194246 -1.477758
H  -0.941998 -3.321207 -2.588543
H  -3.493995 -4.065355 0.794116
H  -1.8525 -4.881049 -0.882079
totalener: -1461.17379717 hartree
nucrepener: 2086.75798661 hartree
electener: -3547.93178378 hartree
oneelecener: -6150.86409701 hartree
twoeener: 2602.93231323 hartree
kineticenergy: 1456.19233575 hartree
xcener: -118.610076660152 hartree
chargesum: -0.0000000
charge: 0.037565 -0.194280 -0.202125 -0.221688 -0.309213 -0.102077 0.267022 -0.167980 -0.066356 0.248525 -0.303157 -0.084277 -0.189533 0.053080 -0.208753 -0.106273 -0.181779 -0.170818 0.242624 0.327733 -0.191845 -0.191417 -0.077354 0.102256 0.109242 0.095934 0.098149 0.098192 0.089164 0.098799 0.104196 0.096598 0.115310 0.099036 0.077155 0.097533 0.123706 0.126945 0.127283 0.132880
qa: 0.0376 -0.1943 -0.2021 -0.2217 -0.3092 -0.1021 0.2670 -0.1680 -0.0664 0.2485 -0.3032 -0.0843 -0.1895 0.0531 -0.2088 -0.1063 -0.1818 -0.1708 0.2426 0.3277 -0.1918 -0.1914 -0.0774 0.1023 0.1092 0.0959 0.0981 0.0982 0.0892 0.0988 0.1042 0.0966 0.1153 0.0990 0.0772 0.0975 0.1237 0.1269 0.1273 0.1329
va: 2.7784 1.1034 1.0895 2.0473 1.9831 2.9675 3.9196 3.9592 4.0294 3.5457 3.9779 3.6782 3.9026 3.9209 3.5617 3.9622 3.9371 4.0486 3.9522 3.8394 3.9734 3.9673 3.8806 1.0107 1.0182 1.0031 0.9965 1.0146 1.0120 1.0047 0.9926 1.0105 1.0105 1.0065 1.0025 1.0076 1.0104 1.0085 1.0079 0.9967
dispcorr: -0.019410828 hartree
energy: -1461.193207995497
dipole: 9.09103 -9.09232 -0.00129 8.05637 -8.87998 -0.82362 8.19988 -8.93462 -0.73474
magnitude: 1.10371 au
magnitude: 2.80541 debye
