program: Orca
programVersion: 5.0.2
elementType: S F F O O N C C C C C C C C C C C C C C C C C H H H H H H H H H H H H H H H H H
charge: 0
multiplicity: 1
keywords: wb97x-d3
keywords: def2-TZVPP
keywords: def2/J RIJCOSX
keywords: DEFGRID2
keywords: scfconv7
keywords: smallprint printgap noloewdin
keywords: NOSOSCF
formula: C17H17F2NO2S
InChI: InChI=1/C17H17F2NO2S/c1-11-6-7-23-16(11)15-8-17(2,22-20-15)10-21-9-12-13(18)4-3-5-14(12)19/h3-7H,8-10H2,1-2H3
40 atoms
S  4.263628 1.383395 -0.834851
F  -2.896361 -3.544083 -0.269723
F  -3.709479 0.673076 -2.12977
O  0.337792 0.61003 1.911999
O  -1.078511 -0.303444 -1.268594
N  1.689569 0.624231 2.037305
C  -0.057464 0.834494 0.54057
C  1.25926 1.123334 -0.186532
C  -0.704208 -0.465922 0.073685
C  2.244783 0.898848 0.923446
C  -1.030684 1.997839 0.503167
C  3.680596 1.006096 0.750423
C  4.716762 0.86984 1.644251
C  -1.828951 -1.362069 -1.799892
C  -3.222937 -1.427197 -1.225822
C  5.974664 1.074503 1.014669
C  4.604943 0.553599 3.101304
C  5.885049 1.356919 -0.311551
C  -3.69803 -2.492969 -0.474835
C  -4.109534 -0.370192 -1.400389
C  -4.965736 -2.527551 0.076138
C  -5.383372 -0.35272 -0.870587
C  -5.803671 -1.444715 -0.126612
H  1.315303 2.147456 -0.566366
H  1.429334 0.460173 -1.03744
H  -1.569141 -0.683114 0.715448
H  0.005854 -1.29888 0.188645
H  -1.916241 1.789725 1.105093
H  -0.560451 2.900546 0.894376
H  -1.355411 2.194941 -0.517424
H  -1.319741 -2.321574 -1.658239
H  -1.881388 -1.186419 -2.875631
H  6.914978 1.010897 1.544663
H  3.575259 0.428041 3.418894
H  5.14721 -0.364408 3.335017
H  5.051042 1.349926 3.699757
H  6.689121 1.551845 -1.002854
H  -5.280685 -3.385765 0.65298
H  -6.028897 0.497461 -1.041054
H  -6.797765 -1.451169 0.298342
totalener: -1461.17238277 hartree
nucrepener: 2032.39274903 hartree
electener: -3493.56513181 hartree
oneelecener: -6042.16271100 hartree
twoeener: 2548.59757919 hartree
kineticenergy: 1456.17694864 hartree
xcener: -118.607654280286 hartree
chargesum: -0.0000000
charge: 0.032930 -0.202348 -0.193559 -0.218746 -0.313965 -0.097084 0.286412 -0.180110 -0.077793 0.270444 -0.311755 -0.071973 -0.196975 0.055917 -0.210434 -0.096147 -0.246102 -0.171531 0.324551 0.255762 -0.192487 -0.199079 -0.077245 0.102359 0.109756 0.100025 0.100001 0.087506 0.098433 0.102167 0.095429 0.106293 0.119958 0.115706 0.091119 0.091775 0.124255 0.127092 0.126886 0.132556
qa: 0.0329 -0.2023 -0.1936 -0.2187 -0.3140 -0.0971 0.2864 -0.1801 -0.0778 0.2704 -0.3118 -0.0720 -0.1970 0.0559 -0.2104 -0.0961 -0.2461 -0.1715 0.3246 0.2558 -0.1925 -0.1991 -0.0772 0.1024 0.1098 0.1000 0.1000 0.0875 0.0984 0.1022 0.0954 0.1063 0.1200 0.1157 0.0911 0.0918 0.1243 0.1271 0.1269 0.1326
va: 2.7671 1.0891 1.1058 2.0439 1.9844 2.9995 3.9136 3.9478 4.0393 3.5065 3.9627 3.6674 3.8377 3.9168 3.5742 3.9585 3.9282 4.0517 3.8409 3.9553 3.9652 3.9760 3.8803 1.0106 1.0222 0.9987 1.0016 1.0127 1.0078 1.0146 1.0112 0.9910 1.0068 1.0329 0.9971 0.9970 1.0101 1.0080 1.0086 0.9966
dispcorr: -0.018932479 hartree
energy: -1461.191315252565
dipole: 9.32097 -9.78990 -0.46893 6.11025 -6.24381 -0.13357 8.95943 -9.50537 -0.54594
magnitude: 0.73197 au
magnitude: 1.86053 debye
