program: Orca
programVersion: 5.0.2
elementType: S F F O O N C C C C C C C C C C C C C C C C C H H H H H H H H H H H H H H H H H
charge: 0
multiplicity: 1
keywords: wb97x-d3
keywords: def2-TZVPP
keywords: def2/J RIJCOSX
keywords: DEFGRID2
keywords: scfconv7
keywords: smallprint printgap noloewdin
keywords: NOSOSCF
formula: C17H17F2NO2S
InChI: InChI=1/C17H17F2NO2S/c1-11-6-7-23-16(11)15-8-17(2,22-20-15)10-21-9-12-13(18)4-3-5-14(12)19/h3-7H,8-10H2,1-2H3
40 atoms
S  3.687047 2.552254 -0.780165
F  -4.616525 0.276043 -1.219485
F  -1.640273 -3.328344 -1.18296
O  0.594099 0.102576 2.08325
O  -1.489301 0.31082 -0.843751
N  1.930334 0.25481 1.889294
C  -0.155881 0.78957 1.057797
C  0.899569 1.613394 0.315158
C  -0.749648 -0.305202 0.176586
C  2.153227 1.066189 0.929755
C  -1.229188 1.630855 1.720798
C  3.488752 1.434015 0.520192
C  4.702305 1.030566 1.027819
C  -2.008881 -0.573832 -1.80035
C  -3.078358 -1.482306 -1.248246
C  5.780385 1.644791 0.338752
C  4.88359 0.074398 2.160336
C  5.385684 2.484169 -0.657016
C  -4.352504 -1.0068 -0.963469
C  -2.856066 -2.820043 -0.954069
C  -5.358788 -1.796392 -0.444616
C  -3.825939 -3.655308 -0.432668
C  -5.082198 -3.12928 -0.181966
H  0.808788 2.687744 0.502079
H  0.859893 1.474863 -0.76717
H  -1.377735 -0.959776 0.796095
H  0.059396 -0.925079 -0.238815
H  -1.805879 2.17356 0.973203
H  -1.919524 1.010232 2.293395
H  -0.780375 2.355577 2.400483
H  -1.212146 -1.175125 -2.252288
H  -2.427924 0.047549 -2.592376
H  6.817278 1.461659 0.58329
H  4.434858 -0.894487 1.941159
H  5.941625 -0.076695 2.370105
H  4.400925 0.434709 3.068594
H  6.00777 3.064894 -1.318888
H  -6.334979 -1.373578 -0.252497
H  -3.595213 -4.690966 -0.226288
H  -5.856144 -3.764949 0.225388
totalener: -1461.17443739 hartree
nucrepener: 2034.85243179 hartree
electener: -3496.02686918 hartree
oneelecener: -6047.07210860 hartree
twoeener: 2551.04523942 hartree
kineticenergy: 1456.18743614 hartree
xcener: -118.608920254689 hartree
chargesum: 0.0000000
charge: 0.037060 -0.195394 -0.200556 -0.220163 -0.315045 -0.107969 0.266852 -0.164957 -0.067697 0.247965 -0.293686 -0.090069 -0.182952 0.049873 -0.220145 -0.106934 -0.180534 -0.170087 0.274451 0.326139 -0.209416 -0.190938 -0.074257 0.101700 0.107813 0.094393 0.102574 0.102137 0.088442 0.094517 0.098103 0.100195 0.114650 0.098055 0.076567 0.098588 0.123602 0.126917 0.126974 0.133232
qa: 0.0371 -0.1954 -0.2006 -0.2202 -0.3150 -0.1080 0.2669 -0.1650 -0.0677 0.2480 -0.2937 -0.0901 -0.1830 0.0499 -0.2201 -0.1069 -0.1805 -0.1701 0.2745 0.3261 -0.2094 -0.1909 -0.0743 0.1017 0.1078 0.0944 0.1026 0.1021 0.0884 0.0945 0.0981 0.1002 0.1147 0.0981 0.0766 0.0986 0.1236 0.1269 0.1270 0.1332
va: 2.7768 1.1056 1.0907 2.0445 1.9835 2.9622 3.9801 3.9328 4.0281 3.5345 3.9475 3.6854 3.8994 3.9193 3.5670 3.9654 3.9365 4.0490 3.9503 3.8326 3.9734 3.9751 3.8757 1.0108 1.0230 1.0042 0.9998 1.0136 1.0125 1.0083 1.0070 0.9950 1.0107 1.0072 1.0027 1.0070 1.0104 1.0083 1.0084 0.9964
dispcorr: -0.018808876 hartree
energy: -1461.193246266652
dipole: 9.49135 -9.98901 -0.49765 3.60817 -3.78109 -0.17292 9.23510 -9.80301 -0.56791
magnitude: 0.77465 au
magnitude: 1.96900 debye
