program: Orca
programVersion: 5.0.2
elementType: S F F O O N C C C C C C C C C C C C C C C C C H H H H H H H H H H H H H H H H H
charge: 0
multiplicity: 1
keywords: wb97x-d3
keywords: def2-TZVPP
keywords: def2/J RIJCOSX
keywords: DEFGRID2
keywords: scfconv7
keywords: smallprint printgap noloewdin
keywords: NOSOSCF
formula: C17H17F2NO2S
InChI: InChI=1/C17H17F2NO2S/c1-11-6-7-23-16(11)15-8-17(2,22-20-15)10-21-9-12-13(18)4-3-5-14(12)19/h3-7H,8-10H2,1-2H3
40 atoms
S  3.401596 0.624022 -0.952228
F  -4.17644 -1.617136 0.796286
F  -1.40707 -0.854554 -2.892925
O  -0.182187 1.924532 2.088583
O  -2.199675 1.158377 -0.78937
N  1.064206 1.384205 2.120966
C  -0.637648 2.088874 0.727937
C  0.594143 1.760173 -0.121526
C  -1.746627 1.060344 0.534518
C  1.533924 1.27128 0.939767
C  -1.135309 3.510762 0.553388
C  2.857949 0.753981 0.680713
C  3.821924 0.334686 1.568561
C  -3.243431 0.280612 -1.114917
C  -2.825827 -1.167123 -1.062644
C  4.996382 -0.0882 0.893071
C  3.675081 0.321782 3.054653
C  4.91442 0.011246 -0.461689
C  -3.291441 -2.057252 -0.105788
C  -1.891375 -1.674927 -1.957113
C  -2.880866 -3.375165 -0.03276
C  -1.446183 -2.980565 -1.928408
C  -1.952156 -3.828281 -0.95473
H  1.001934 2.636511 -0.633977
H  0.392571 1.009971 -0.889397
H  -2.559441 1.253461 1.249712
H  -1.349698 0.058834 0.755032
H  -1.955352 3.727551 1.23878
H  -0.334047 4.223635 0.74901
H  -1.493156 3.669188 -0.462824
H  -3.553131 0.540272 -2.128092
H  -4.109569 0.440718 -0.4640
H  5.873489 -0.454327 1.408052
H  4.589054 -0.034876 3.527562
H  3.452002 1.315372 3.442936
H  2.852241 -0.31968 3.369981
H  5.666277 -0.244125 -1.190913
H  -3.278008 -4.024837 0.734597
H  -0.719615 -3.322131 -2.652295
H  -1.614554 -4.854602 -0.913179
totalener: -1461.17435504 hartree
nucrepener: 2092.39603739 hartree
electener: -3553.57039243 hartree
oneelecener: -6162.16893550 hartree
twoeener: 2608.59854307 hartree
kineticenergy: 1456.18763669 hartree
xcener: -118.609442512163 hartree
chargesum: 0.0000000
charge: 0.038862 -0.202120 -0.195020 -0.222608 -0.311808 -0.107610 0.277743 -0.159018 -0.085293 0.241445 -0.295014 -0.086899 -0.184142 0.051977 -0.221717 -0.108383 -0.180101 -0.170468 0.335031 0.255998 -0.193286 -0.196168 -0.075658 0.101775 0.112440 0.097071 0.100358 0.089524 0.094091 0.099948 0.103762 0.096937 0.115143 0.076533 0.098281 0.097946 0.123868 0.127145 0.126724 0.132712
qa: 0.0389 -0.2021 -0.1950 -0.2226 -0.3118 -0.1076 0.2777 -0.1590 -0.0853 0.2414 -0.2950 -0.0869 -0.1841 0.0520 -0.2217 -0.1084 -0.1801 -0.1705 0.3350 0.2560 -0.1933 -0.1962 -0.0757 0.1018 0.1124 0.0971 0.1004 0.0895 0.0941 0.0999 0.1038 0.0969 0.1151 0.0765 0.0983 0.0979 0.1239 0.1271 0.1267 0.1327
va: 2.7789 1.0897 1.1040 2.0425 1.9800 2.9678 3.9310 3.9319 4.0603 3.5436 3.9549 3.6849 3.8983 3.9194 3.5631 3.9644 3.9363 4.0480 3.8320 3.9551 3.9710 3.9718 3.8779 1.0110 1.0204 1.0040 0.9942 1.0119 1.0079 1.0138 0.9926 1.0104 1.0107 1.0026 1.0077 1.0070 1.0102 1.0081 1.0084 0.9967
dispcorr: -0.019362974 hartree
energy: -1461.193718013051
dipole: 7.78005 -7.71448 0.06558 7.51291 -8.34521 -0.83230 8.62107 -9.33569 -0.71462
magnitude: 1.09895 au
magnitude: 2.79332 debye
