program: Orca
programVersion: 5.0.2
elementType: S F F O O N C C C C C C C C C C C C C C C C C H H H H H H H H H H H H H H H H H
charge: 0
multiplicity: 1
keywords: wb97x-d3
keywords: def2-TZVPP
keywords: def2/J RIJCOSX
keywords: DEFGRID2
keywords: scfconv7
keywords: smallprint printgap noloewdin
keywords: NOSOSCF
formula: C17H17F2NO2S
InChI: InChI=1/C17H17F2NO2S/c1-11-6-7-23-16(11)15-8-17(2,22-20-15)10-21-9-12-13(18)4-3-5-14(12)19/h3-7H,8-10H2,1-2H3
40 atoms
S  3.338095 0.74888 -0.886726
F  -1.265757 -0.689449 -2.909245
F  -4.053027 -1.83034 0.671924
O  -0.272213 1.930233 2.172974
O  -2.230389 1.161102 -0.745267
N  0.966959 1.370525 2.192892
C  -0.725504 2.117079 0.81528
C  0.524365 1.863152 -0.0318
C  -1.785594 1.04528 0.580001
C  1.445837 1.305161 1.011533
C  -1.284354 3.519876 0.680412
C  2.761868 0.77418 0.740062
C  3.694265 0.26415 1.614201
C  -3.21097 0.230314 -1.115052
C  -2.698259 -1.187986 -1.128759
C  4.871889 -0.141149 0.933538
C  3.512129 0.145108 3.091584
C  4.823532 0.061019 -0.411418
C  -1.719453 -1.588129 -2.031053
C  -3.124714 -2.158382 -0.233308
C  -1.19906 -2.865654 -2.067335
C  -2.637282 -3.451517 -0.226118
C  -1.668973 -3.796413 -1.153337
H  0.93594 2.779075 -0.467048
H  0.343365 1.172391 -0.857791
H  -2.613072 1.181343 1.291477
H  -1.346323 0.05629 0.775719
H  -0.520166 4.260781 0.915809
H  -1.631364 3.697614 -0.336265
H  -2.125637 3.675498 1.356617
H  -3.536154 0.51475 -2.116864
H  -4.087777 0.302061 -0.462297
H  5.726657 -0.569498 1.437977
H  4.394425 -0.296137 3.553247
H  3.333391 1.116927 3.551569
H  2.648741 -0.471879 3.340002
H  5.584569 -0.161514 -1.141856
H  -0.441742 -3.121689 -2.794744
H  -3.008719 -4.165227 0.495774
H  -1.272498 -4.802204 -1.163497
totalener: -1461.17444147 hartree
nucrepener: 2100.27535175 hartree
electener: -3561.44979321 hartree
oneelecener: -6177.93325741 hartree
twoeener: 2616.48346420 hartree
kineticenergy: 1456.18619590 hartree
xcener: -118.609252630255 hartree
chargesum: 0.0000000
charge: 0.039688 -0.195041 -0.202120 -0.223984 -0.312010 -0.108846 0.283039 -0.154959 -0.093063 0.233065 -0.292141 -0.084435 -0.180570 0.051751 -0.219455 -0.109089 -0.179570 -0.170362 0.253396 0.335088 -0.195269 -0.193628 -0.075163 0.101384 0.112690 0.096590 0.102440 0.093238 0.100143 0.089578 0.104474 0.096779 0.114635 0.076095 0.099192 0.097212 0.123774 0.126391 0.126485 0.132579
qa: 0.0397 -0.1950 -0.2021 -0.2240 -0.3120 -0.1088 0.2830 -0.1550 -0.0931 0.2331 -0.2921 -0.0844 -0.1806 0.0518 -0.2195 -0.1091 -0.1796 -0.1704 0.2534 0.3351 -0.1953 -0.1936 -0.0752 0.1014 0.1127 0.0966 0.1024 0.0932 0.1001 0.0896 0.1045 0.0968 0.1146 0.0761 0.0992 0.0972 0.1238 0.1264 0.1265 0.1326
va: 2.7788 1.1041 1.0897 2.0404 1.9801 2.9649 3.9340 3.9235 4.0677 3.5448 3.9468 3.6901 3.8959 3.9195 3.5632 3.9653 3.9347 4.0477 3.9578 3.8330 3.9727 3.9704 3.8781 1.0112 1.0211 1.0044 0.9925 1.0090 1.0134 1.0117 0.9922 1.0108 1.0108 1.0027 1.0072 1.0078 1.0101 1.0087 1.0085 0.9967
dispcorr: -0.019468866 hartree
energy: -1461.193910333245
dipole: 7.00025 -6.88854 0.11170 7.06508 -7.89199 -0.82691 8.93253 -9.69030 -0.75776
magnitude: 1.12715 au
magnitude: 2.86498 debye
