program: Orca
programVersion: 5.0.2
elementType: S F F O O N C C C C C C C C C C C C C C C C C H H H H H H H H H H H H H H H H H
charge: 0
multiplicity: 1
keywords: wb97x-d3
keywords: def2-TZVPP
keywords: def2/J RIJCOSX
keywords: DEFGRID2
keywords: scfconv7
keywords: smallprint printgap noloewdin
keywords: NOSOSCF
formula: C17H17F2NO2S
InChI: InChI=1/C17H17F2NO2S/c1-11-6-7-23-16(11)15-8-17(2,22-20-15)10-21-9-12-13(18)4-3-5-14(12)19/h3-7H,8-10H2,1-2H3
40 atoms
S  4.346153 1.40352 -0.858284
F  -3.000025 -3.513757 -0.28568
F  -3.740918 0.7510 -2.06318
O  0.408547 0.479844 1.865463
O  -1.111496 -0.328286 -1.295059
N  1.758996 0.548127 1.980453
C  -0.013519 0.743723 0.508522
C  1.292126 1.018389 -0.24574
C  -0.708823 -0.527579 0.034132
C  2.291374 0.842011 0.858805
C  -0.954767 1.934398 0.521188
C  3.718814 0.993462 0.696628
C  4.723518 0.864063 1.627898
C  -1.916193 -1.348983 -1.822154
C  -3.292309 -1.376391 -1.203847
C  5.997227 1.103253 1.049627
C  4.521487 0.51808 3.066397
C  5.948286 1.404228 -0.276583
C  -3.775639 -2.436244 -0.450055
C  -4.149765 -0.289606 -1.334881
C  -5.024417 -2.438184 0.143596
C  -5.404483 -0.239394 -0.763128
C  -5.834092 -1.327164 -0.018267
H  1.330711 2.026721 -0.666548
H  1.464955 0.324263 -1.071523
H  -1.563703 -0.732377 0.693077
H  -0.020598 -1.382212 0.115657
H  -1.821012 1.742213 1.154878
H  -0.44659 2.819549 0.904456
H  -1.313359 2.153445 -0.483212
H  -1.437518 -2.32838 -1.715355
H  -1.99624 -1.150015 -2.891992
H  6.919039 1.051162 1.611896
H  5.475778 0.478263 3.589643
H  3.884589 1.247149 3.56719
H  4.026599 -0.446346 3.179778
H  6.771962 1.625346 -0.936109
H  -5.347006 -3.293077 0.721213
H  -6.027851 0.632891 -0.901809
H  -6.813239 -1.307858 0.439832
totalener: -1461.17364663 hartree
nucrepener: 2031.82307140 hartree
electener: -3492.99671803 hartree
oneelecener: -6041.02193040 hartree
twoeener: 2548.02521237 hartree
kineticenergy: 1456.18357936 hartree
xcener: -118.608175823926 hartree
chargesum: -0.0000000
charge: 0.036564 -0.202353 -0.193742 -0.219964 -0.313368 -0.105132 0.280969 -0.179910 -0.072113 0.275747 -0.314215 -0.097947 -0.192835 0.056026 -0.209280 -0.104065 -0.181209 -0.173109 0.323462 0.255201 -0.191769 -0.199143 -0.077347 0.101579 0.109789 0.099833 0.098631 0.087508 0.099780 0.101633 0.095322 0.106157 0.114766 0.076608 0.098809 0.097882 0.124446 0.127193 0.127023 0.132573
qa: 0.0366 -0.2024 -0.1937 -0.2200 -0.3134 -0.1051 0.2810 -0.1799 -0.0721 0.2757 -0.3142 -0.0979 -0.1928 0.0560 -0.2093 -0.1041 -0.1812 -0.1731 0.3235 0.2552 -0.1918 -0.1991 -0.0773 0.1016 0.1098 0.0998 0.0986 0.0875 0.0998 0.1016 0.0953 0.1062 0.1148 0.0766 0.0988 0.0979 0.1244 0.1272 0.1270 0.1326
va: 2.7770 1.0890 1.1056 2.0492 1.9852 2.9672 3.9105 3.9567 4.0297 3.5049 3.9692 3.6832 3.9080 3.9167 3.5741 3.9623 3.9374 4.0503 3.8411 3.9547 3.9650 3.9755 3.8808 1.0105 1.0208 0.9988 1.0024 1.0129 1.0067 1.0152 1.0111 0.9911 1.0108 1.0027 1.0070 1.0071 1.0102 1.0079 1.0086 0.9966
dispcorr: -0.019030695 hartree
energy: -1461.192677325910
dipole: 9.14973 -9.68079 -0.53105 5.79831 -5.90452 -0.10621 9.04498 -9.56109 -0.51611
magnitude: 0.74811 au
magnitude: 1.90155 debye
