program: Orca
programVersion: 5.0.2
elementType: S F F O O N C C C C C C C C C C C C C C C C C H H H H H H H H H H H H H H H H H
charge: 0
multiplicity: 1
keywords: wb97x-d3
keywords: def2-TZVPP
keywords: def2/J RIJCOSX
keywords: DEFGRID2
keywords: scfconv7
keywords: smallprint printgap noloewdin
keywords: NOSOSCF
formula: C17H17F2NO2S
InChI: InChI=1/C17H17F2NO2S/c1-11-6-7-23-16(11)15-8-17(2,22-20-15)10-21-9-12-13(18)4-3-5-14(12)19/h3-7H,8-10H2,1-2H3
40 atoms
S  3.214579 0.799189 -0.989076
F  -0.937311 -0.546152 -2.579701
F  -4.239509 -1.977761 0.405672
O  -0.270739 1.919109 2.231197
O  -2.255761 1.173221 -0.673652
N  0.964747 1.348031 2.194305
C  -0.767574 2.133542 0.893913
C  0.466555 1.946732 0.008577
C  -1.797351 1.033952 0.644443
C  1.410367 1.331811 0.998181
C  -1.377751 3.518799 0.817457
C  2.711617 0.801562 0.662246
C  3.679765 0.274194 1.485561
C  -3.182908 0.208567 -1.085902
C  -2.620914 -1.191563 -1.092762
C  4.823843 -0.125049 0.746732
C  3.562783 0.132469 2.967427
C  4.715904 0.097705 -0.591511
C  -1.494969 -1.510453 -1.84254
C  -3.160119 -2.227731 -0.344597
C  -0.929022 -2.768666 -1.863907
C  -2.638057 -3.50771 -0.334984
C  -1.515386 -3.768339 -1.102494
H  0.865318 2.892987 -0.370625
H  0.274779 1.311345 -0.857413
H  -2.621225 1.125742 1.367078
H  -1.326757 0.053937 0.809167
H  -2.208282 3.623488 1.516492
H  -0.635006 4.279475 1.057727
H  -1.755263 3.714071 -0.185108
H  -3.479887 0.49014 -2.097865
H  -4.086456 0.240529 -0.467752
H  5.698954 -0.563384 1.205676
H  2.7210 -0.502555 3.243268
H  4.470793 -0.300399 3.384978
H  3.387856 1.094685 3.44839
H  5.442962 -0.115703 -1.358388
H  -0.050337 -2.957533 -2.46461
H  -3.102182 -4.27723 0.265847
H  -1.088791 -4.761808 -1.106178
totalener: -1461.17383821 hartree
nucrepener: 2113.73930451 hartree
electener: -3574.91314272 hartree
oneelecener: -6204.88731219 hartree
twoeener: 2629.97416947 hartree
kineticenergy: 1456.18944842 hartree
xcener: -118.610472366711 hartree
chargesum: 0.0000000
charge: 0.040562 -0.194557 -0.203259 -0.225631 -0.311475 -0.110657 0.295576 -0.160143 -0.106320 0.227287 -0.290458 -0.081163 -0.177530 0.052261 -0.209858 -0.109151 -0.179883 -0.170601 0.248351 0.335643 -0.191363 -0.199943 -0.075968 0.101840 0.115253 0.096978 0.104204 0.089222 0.092246 0.100244 0.104660 0.096248 0.114291 0.097999 0.076069 0.098886 0.123791 0.127656 0.126334 0.132357
qa: 0.0406 -0.1946 -0.2033 -0.2256 -0.3115 -0.1107 0.2956 -0.1601 -0.1063 0.2273 -0.2905 -0.0812 -0.1775 0.0523 -0.2099 -0.1092 -0.1799 -0.1706 0.2484 0.3356 -0.1914 -0.1999 -0.0760 0.1018 0.1153 0.0970 0.1042 0.0892 0.0922 0.1002 0.1047 0.0962 0.1143 0.0980 0.0761 0.0989 0.1238 0.1277 0.1263 0.1324
va: 2.7802 1.1053 1.0901 2.0375 1.9803 2.9639 3.9219 3.9187 4.0719 3.5457 3.9416 3.6873 3.8911 3.9216 3.5632 3.9648 3.9346 4.0475 3.9533 3.8487 3.9788 3.9699 3.8807 1.0118 1.0206 1.0044 0.9919 1.0116 1.0099 1.0131 0.9904 1.0122 1.0109 1.0073 1.0026 1.0074 1.0101 1.0085 1.0082 0.9966
dispcorr: -0.019819735 hartree
energy: -1461.193657942453
dipole: 6.89879 -6.77268 0.12611 7.05391 -7.85836 -0.80445 8.94105 -9.73251 -0.79146
magnitude: 1.13554 au
magnitude: 2.88630 debye
