program: Orca
programVersion: 5.0.2
elementType: S F F O O N C C C C C C C C C C C C C C C C C H H H H H H H H H H H H H H H H H
charge: 0
multiplicity: 1
keywords: wb97x-d3
keywords: def2-TZVPP
keywords: def2/J RIJCOSX
keywords: DEFGRID2
keywords: scfconv7
keywords: smallprint printgap noloewdin
keywords: NOSOSCF
formula: C17H17F2NO2S
InChI: InChI=1/C17H17F2NO2S/c1-11-6-7-23-16(11)15-8-17(2,22-20-15)10-21-9-12-13(18)4-3-5-14(12)19/h3-7H,8-10H2,1-2H3
40 atoms
S  2.992235 0.764776 -0.914653
F  -0.521253 -0.479953 -2.649075
F  -3.301492 -1.470588 0.982297
O  -1.25645 0.978438 1.430057
O  -2.333986 1.430278 -1.432273
N  -0.079839 0.300696 1.482543
C  -1.127768 2.158651 0.606999
C  0.196798 1.949197 -0.128668
C  -2.346779 2.260458 -0.308956
C  0.746804 0.786468 0.640673
C  -1.085816 3.361451 1.539288
C  2.062754 0.227398 0.43634
C  2.724674 -0.741853 1.152745
C  -2.911851 0.154173 -1.319891
C  -1.96155 -0.919266 -0.857505
C  3.993339 -1.027742 0.582874
C  2.197537 -1.41316 2.377752
C  4.270775 -0.295271 -0.530592
C  -0.79116 -1.197419 -1.551332
C  -2.19379 -1.695411 0.267901
C  0.106962 -2.172593 -1.168225
C  -1.337904 -2.694429 0.686027
C  -0.183599 -2.926045 -0.042705
H  0.848816 2.8236 -0.068491
H  0.072137 1.704874 -1.186439
H  -2.387441 3.284916 -0.690662
H  -3.252347 2.110329 0.295867
H  -0.267993 3.266303 2.254138
H  -0.9358 4.284522 0.977858
H  -2.013553 3.455451 2.105767
H  -3.274045 -0.098546 -2.3192
H  -3.787813 0.179198 -0.665255
H  4.676356 -1.755891 0.997893
H  1.287667 -1.973298 2.163795
H  2.938013 -2.097069 2.791246
H  1.933518 -0.688382 3.148394
H  5.161339 -0.324535 -1.137531
H  1.011263 -2.331871 -1.738699
H  -1.569943 -3.267387 1.572861
H  0.50299 -3.700089 0.272186
totalener: -1461.16939914 hartree
nucrepener: 2279.91413287 hartree
electener: -3741.08353201 hartree
oneelecener: -6537.81679416 hartree
twoeener: 2796.73326215 hartree
kineticenergy: 1456.20797178 hartree
xcener: -118.620643553032 hartree
chargesum: 0.0000000
charge: 0.042091 -0.198465 -0.207192 -0.230094 -0.312964 -0.085631 0.263307 -0.193115 -0.020160 0.247815 -0.313355 -0.104083 -0.202319 0.025995 -0.176462 -0.099574 -0.194000 -0.177581 0.277436 0.344496 -0.186363 -0.157787 -0.141371 0.116620 0.130784 0.092674 0.082620 0.105309 0.080576 0.100741 0.106194 0.093053 0.115268 0.095963 0.080633 0.099182 0.124651 0.120705 0.117519 0.136884
qa: 0.0421 -0.1985 -0.2072 -0.2301 -0.3130 -0.0856 0.2633 -0.1931 -0.0202 0.2478 -0.3134 -0.1041 -0.2023 0.0260 -0.1765 -0.0996 -0.1940 -0.1776 0.2774 0.3445 -0.1864 -0.1578 -0.1414 0.1166 0.1308 0.0927 0.0826 0.1053 0.0806 0.1007 0.1062 0.0931 0.1153 0.0960 0.0806 0.0992 0.1247 0.1207 0.1175 0.1369
va: 2.7766 1.1001 1.0887 2.0209 2.0077 2.8974 3.8017 3.9424 3.9796 3.4785 3.9858 3.6389 3.8517 3.9470 3.5855 3.9519 3.9391 4.0484 3.8744 3.8557 3.9091 3.9194 3.8713 1.0123 1.0258 0.9983 1.0112 1.0038 1.0079 1.0088 0.9913 1.0121 1.0102 1.0067 1.0032 1.0081 1.0104 1.0104 1.0095 0.9929
dispcorr: -0.026318689 hartree
energy: -1461.195717827437
dipole: 4.53594 -3.94684 0.58909 7.02647 -6.84605 0.18042 9.92710 -9.89077 0.03634
magnitude: 0.61717 au
magnitude: 1.56873 debye
