program: Orca
programVersion: 5.0.2
elementType: S F F O O N C C C C C C C C C C C C C C C C C H H H H H H H H H H H H H H H H H
charge: 0
multiplicity: 1
keywords: wb97x-d3
keywords: def2-TZVPP
keywords: def2/J RIJCOSX
keywords: DEFGRID2
keywords: scfconv7
keywords: smallprint printgap noloewdin
keywords: NOSOSCF
formula: C17H17F2NO2S
InChI: InChI=1/C17H17F2NO2S/c1-11-6-7-23-16(11)15-8-17(2,22-20-15)10-21-9-12-13(18)4-3-5-14(12)19/h3-7H,8-10H2,1-2H3
40 atoms
S  3.129302 0.715441 -0.987071
F  -0.887229 -0.485148 -2.575683
F  -4.154414 -2.021545 0.396078
O  -0.295021 1.977774 2.242913
O  -2.259677 1.190202 -0.665376
N  0.920039 1.361397 2.206276
C  -0.79183 2.179968 0.904486
C  0.445483 1.993846 0.025702
C  -1.810947 1.06842 0.6578
C  1.365121 1.334828 1.009881
C  -1.414973 3.558294 0.817959
C  2.643559 0.755168 0.669011
C  3.597684 0.197371 1.488478
C  -3.156769 0.200432 -1.083891
C  -2.554407 -1.183005 -1.093785
C  4.716956 -0.25608 0.742963
C  3.488962 0.075343 2.972695
C  4.604276 -0.043315 -0.596558
C  -1.419068 -1.46757 -1.843283
C  -3.066641 -2.23752 -0.35238
C  -0.819649 -2.710099 -1.870781
C  -2.510282 -3.503028 -0.348478
C  -1.379969 -3.729304 -1.115593
H  0.869187 2.942653 -0.31916
H  0.248507 1.389399 -0.860581
H  -2.641356 1.160731 1.372698
H  -1.333906 0.093921 0.835966
H  -2.239048 3.663394 1.524548
H  -0.677493 4.329384 1.040393
H  -1.805477 3.7369 -0.182737
H  -3.457543 0.476385 -2.096331
H  -4.063663 0.204171 -0.46981
H  5.578106 -0.72504 1.198014
H  4.388921 -0.375688 3.388419
H  3.342091 1.047017 3.443937
H  2.633458 -0.534991 3.261909
H  5.314458 -0.293682 -1.368105
H  0.064574 -2.871975 -2.471219
H  -2.954625 -4.287936 0.24741
H  -0.927059 -4.711058 -1.124214
totalener: -1461.17386632 hartree
nucrepener: 2122.55273202 hartree
electener: -3583.72659834 hartree
oneelecener: -6222.52122006 hartree
twoeener: 2638.79462172 hartree
kineticenergy: 1456.18936113 hartree
xcener: -118.610500098917 hartree
chargesum: 0.0000000
charge: 0.040668 -0.195001 -0.203252 -0.226774 -0.311810 -0.111619 0.299376 -0.156783 -0.111523 0.217820 -0.286504 -0.077688 -0.174408 0.052223 -0.209309 -0.109563 -0.179947 -0.170843 0.248701 0.334917 -0.190838 -0.199715 -0.075624 0.101733 0.114874 0.096626 0.105626 0.089358 0.090893 0.100117 0.104866 0.096455 0.114410 0.076223 0.098777 0.098265 0.123898 0.126889 0.126269 0.132215
qa: 0.0407 -0.1950 -0.2033 -0.2268 -0.3118 -0.1116 0.2994 -0.1568 -0.1115 0.2178 -0.2865 -0.0777 -0.1744 0.0522 -0.2093 -0.1096 -0.1799 -0.1708 0.2487 0.3349 -0.1908 -0.1997 -0.0756 0.1017 0.1149 0.0966 0.1056 0.0894 0.0909 0.1001 0.1049 0.0965 0.1144 0.0762 0.0988 0.0983 0.1239 0.1269 0.1263 0.1322
va: 2.7804 1.1046 1.0900 2.0360 1.9806 2.9595 3.9269 3.9106 4.0716 3.5506 3.9333 3.6881 3.8880 3.9207 3.5640 3.9644 3.9341 4.0471 3.9509 3.8493 3.9799 3.9696 3.8807 1.0123 1.0215 1.0048 0.9913 1.0117 1.0106 1.0134 0.9905 1.0122 1.0109 1.0026 1.0074 1.0073 1.0101 1.0090 1.0082 0.9966
dispcorr: -0.019998458 hartree
energy: -1461.193864776200
dipole: 6.65101 -6.49868 0.15234 7.06168 -7.87465 -0.81297 8.94594 -9.74437 -0.79843
magnitude: 1.14961 au
magnitude: 2.92209 debye
