program: Orca
programVersion: 5.0.2
elementType: S F F O O N C C C C C C C C C C C C C C C C C H H H H H H H H H H H H H H H H H
charge: 0
multiplicity: 1
keywords: wb97x-d3
keywords: def2-TZVPP
keywords: def2/J RIJCOSX
keywords: DEFGRID2
keywords: scfconv7
keywords: smallprint printgap noloewdin
keywords: NOSOSCF
formula: C17H17F2NO2S
InChI: InChI=1/C17H17F2NO2S/c1-11-6-7-23-16(11)15-8-17(2,22-20-15)10-21-9-12-13(18)4-3-5-14(12)19/h3-7H,8-10H2,1-2H3
40 atoms
S  3.449424 1.315349 -1.057169
F  -4.633256 -1.626438 0.066637
F  -0.077891 -1.825938 -0.955701
O  -0.467643 1.769473 1.808207
O  -2.011121 0.632597 -0.532513
N  0.810347 1.307491 1.862566
C  -0.720292 2.436875 0.550905
C  0.495571 2.074405 -0.304895
C  -2.046663 1.924238 -0.005744
C  1.384828 1.458411 0.73272
C  -0.814738 3.93012 0.826953
C  2.74543 1.036026 0.494004
C  3.627311 0.407667 1.342924
C  -2.081025 -0.428834 0.396682
C  -2.339822 -1.677435 -0.389798
C  4.87185 0.164602 0.705717
C  3.334409 0.017432 2.754297
C  4.921272 0.599311 -0.582753
C  -3.606137 -2.217342 -0.552355
C  -1.313679 -2.320148 -1.068816
C  -3.856003 -3.341908 -1.315473
C  -1.507464 -3.444123 -1.846344
C  -2.792636 -3.949758 -1.962633
H  0.948788 2.949272 -0.776444
H  0.26686 1.352821 -1.093501
H  -2.344945 2.578741 -0.829641
H  -2.815724 2.021544 0.775143
H  -1.64441 4.156841 1.498059
H  0.100531 4.295642 1.293044
H  -0.966049 4.486941 -0.098859
H  -2.882271 -0.257624 1.123368
H  -1.157295 -0.539792 0.968536
H  5.70176 -0.321013 1.19965
H  4.189767 -0.491133 3.196882
H  3.096035 0.885596 3.36859
H  2.471686 -0.645395 2.815185
H  5.745919 0.529765 -1.273617
H  -4.862662 -3.725519 -1.40195
H  -0.669947 -3.906302 -2.349754
H  -2.967588 -4.828278 -2.568112
totalener: -1461.17346562 hartree
nucrepener: 2100.98853188 hartree
electener: -3562.16199749 hartree
oneelecener: -6179.70552276 hartree
twoeener: 2617.54352526 hartree
kineticenergy: 1456.19600524 hartree
xcener: -118.610856279393 hartree
chargesum: -0.0000000
charge: 0.038429 -0.203019 -0.199663 -0.224355 -0.316510 -0.115876 0.185208 -0.150167 -0.012115 0.263861 -0.294026 -0.096290 -0.185542 0.080368 -0.182132 -0.107201 -0.183033 -0.170232 0.297781 0.291638 -0.208318 -0.197642 -0.075004 0.103684 0.122810 0.091232 0.088060 0.098340 0.105595 0.081898 0.078682 0.105221 0.113931 0.076744 0.098068 0.098422 0.124275 0.123166 0.124166 0.129546
qa: 0.0384 -0.2030 -0.1997 -0.2244 -0.3165 -0.1159 0.1852 -0.1502 -0.0121 0.2639 -0.2940 -0.0963 -0.1855 0.0804 -0.1821 -0.1072 -0.1830 -0.1702 0.2978 0.2916 -0.2083 -0.1976 -0.0750 0.1037 0.1228 0.0912 0.0881 0.0983 0.1056 0.0819 0.0787 0.1052 0.1139 0.0767 0.0981 0.0984 0.1243 0.1232 0.1242 0.1295
va: 2.7793 1.0956 1.0982 2.0238 1.9815 2.9121 3.8977 3.9088 3.9547 3.5038 3.9832 3.7035 3.9019 3.8827 3.6789 3.9664 3.9372 4.0502 3.9177 3.9203 3.9753 3.9853 3.8788 1.0104 1.0308 1.0003 1.0095 1.0095 1.0041 1.0079 1.0130 0.9936 1.0107 1.0028 1.0069 1.0067 1.0097 1.0092 1.0094 0.9971
dispcorr: -0.019509362 hartree
energy: -1461.192974977301
dipole: 6.36375 -6.17337 0.19038 11.13652 -11.19620 -0.05968 6.41411 -7.14104 -0.72692
magnitude: 0.75381 au
magnitude: 1.91603 debye
