program: Orca
programVersion: 5.0.2
elementType: S F F O O N C C C C C C C C C C C C C C C C C H H H H H H H H H H H H H H H H H
charge: 0
multiplicity: 1
keywords: wb97x-d3
keywords: def2-TZVPP
keywords: def2/J RIJCOSX
keywords: DEFGRID2
keywords: scfconv7
keywords: smallprint printgap noloewdin
keywords: NOSOSCF
formula: C17H17F2NO2S
InChI: InChI=1/C17H17F2NO2S/c1-11-6-7-23-16(11)15-8-17(2,22-20-15)10-21-9-12-13(18)4-3-5-14(12)19/h3-7H,8-10H2,1-2H3
40 atoms
S  2.428945 0.339298 -1.428734
F  -1.937808 -0.217931 -2.719362
F  -2.091728 -2.216524 1.507379
O  -0.194596 2.469604 2.079292
O  -2.764405 1.083872 -0.047131
N  0.90473 1.670666 1.940243
C  -0.986042 2.405939 0.87578
C  0.029343 1.983753 -0.180484
C  -2.015324 1.298255 1.122177
C  1.0565 1.35221 0.711989
C  -1.63036 3.75212 0.631074
C  2.118352 0.482974 0.262557
C  2.968972 -0.305646 1.001789
C  -3.209954 -0.237019 -0.231597
C  -2.076012 -1.167332 -0.587792
C  3.865523 -1.021929 0.16631
C  2.962676 -0.411432 2.491307
C  3.693278 -0.772286 -1.160693
C  -1.450829 -1.08682 -1.826825
C  -1.52971 -2.083465 0.299691
C  -0.349877 -1.841472 -2.173432
C  -0.42434 -2.860009 0.007132
C  0.16415 -2.726645 -1.238107
H  0.460358 2.837516 -0.714891
H  -0.386706 1.311343 -0.928495
H  -2.669735 1.587157 1.955084
H  -1.479871 0.394292 1.43585
H  -2.248545 3.714908 -0.264786
H  -2.268026 4.041747 1.466672
H  -0.874958 4.525777 0.494693
H  -3.933742 -0.203237 -1.046025
H  -3.740182 -0.610643 0.649958
H  4.616771 -1.698298 0.54956
H  3.278001 0.521131 2.958685
H  1.963498 -0.620453 2.873045
H  3.632778 -1.202976 2.824155
H  4.250421 -1.180287 -1.988722
H  0.100294 -1.727724 -3.149293
H  -0.033526 -3.544982 0.746378
H  1.039425 -3.312302 -1.481167
totalener: -1461.17210402 hartree
nucrepener: 2232.52344455 hartree
electener: -3693.69554857 hartree
oneelecener: -6442.29580394 hartree
twoeener: 2748.60025536 hartree
kineticenergy: 1456.19196806 hartree
xcener: -118.613108419204 hartree
chargesum: -0.0000000
charge: 0.037683 -0.197294 -0.203388 -0.230406 -0.323924 -0.100044 0.327417 -0.187177 -0.143828 0.171919 -0.270552 -0.014824 -0.200020 0.057466 -0.150179 -0.097814 -0.187309 -0.184682 0.241514 0.288875 -0.225428 -0.178018 -0.057688 0.108639 0.125435 0.100639 0.114865 0.101108 0.090300 0.087541 0.103422 0.099728 0.117069 0.105331 0.095767 0.076718 0.125040 0.124227 0.124565 0.127306
qa: 0.0377 -0.1973 -0.2034 -0.2304 -0.3239 -0.1000 0.3274 -0.1872 -0.1438 0.1719 -0.2706 -0.0148 -0.2000 0.0575 -0.1502 -0.0978 -0.1873 -0.1847 0.2415 0.2889 -0.2254 -0.1780 -0.0577 0.1086 0.1254 0.1006 0.1149 0.1011 0.0903 0.0875 0.1034 0.0997 0.1171 0.1053 0.0958 0.0767 0.1250 0.1242 0.1246 0.1273
va: 2.7524 1.0975 1.0871 2.0437 1.9723 2.9518 3.8858 3.9242 4.0798 3.5768 3.9098 3.6108 3.8939 3.9211 3.5482 3.9326 3.9353 4.0258 3.8831 3.8399 3.9374 3.9343 3.8143 1.0133 1.0113 1.0086 0.9796 1.0126 1.0112 1.0133 0.9945 1.0028 1.0097 1.0040 1.0092 1.0022 1.0086 1.0135 1.0076 0.9995
dispcorr: -0.024455631 hartree
energy: -1461.196559654792
dipole: 4.94757 -4.61342 0.33415 6.38814 -7.31310 -0.92496 7.21872 -8.01715 -0.79843
magnitude: 1.26677 au
magnitude: 3.21987 debye
