program: Orca
programVersion: 5.0.2
elementType: S F F O O N C C C C C C C C C C C C C C C C C H H H H H H H H H H H H H H H H H
charge: 0
multiplicity: 1
keywords: wb97x-d3
keywords: def2-TZVPP
keywords: def2/J RIJCOSX
keywords: DEFGRID2
keywords: scfconv7
keywords: smallprint printgap noloewdin
keywords: NOSOSCF
formula: C17H17F2NO2S
InChI: InChI=1/C17H17F2NO2S/c1-11-6-7-23-16(11)15-8-17(2,22-20-15)10-21-9-12-13(18)4-3-5-14(12)19/h3-7H,8-10H2,1-2H3
40 atoms
S  3.028644 1.104491 -0.984167
F  -0.510895 -0.575155 -2.295848
F  -3.935359 -2.427341 0.301992
O  -0.589499 2.016226 2.147391
O  -1.803445 0.633082 0.054806
N  0.557746 1.294719 2.070874
C  -0.883438 2.654343 0.8879
C  0.371673 2.405804 0.044253
C  -2.107259 1.973454 0.293708
C  1.118986 1.464704 0.938668
C  -1.163074 4.122891 1.151295
C  2.365797 0.826971 0.585002
C  3.16456 -0.009951 1.329073
C  -2.758515 -0.040733 -0.718298
C  -2.248283 -1.426304 -0.979922
C  4.314835 -0.409292 0.59891
C  2.876623 -0.454858 2.725188
C  4.375795 0.113459 -0.655981
C  -1.106379 -1.635436 -1.743956
C  -2.833908 -2.562931 -0.443693
C  -0.568893 -2.884711 -1.975616
C  -2.340047 -3.837332 -0.650192
C  -1.198266 -3.986923 -1.418424
H  0.947923 3.319144 -0.131924
H  0.153526 1.962345 -0.929185
H  -2.379454 2.495483 -0.638047
H  -2.960411 2.076115 0.981207
H  -2.015254 4.252698 1.81914
H  -0.299669 4.600417 1.613788
H  -1.379708 4.649335 0.22092
H  -2.926721 0.481046 -1.671899
H  -3.728267 -0.079358 -0.209514
H  5.07126 -1.067055 1.003709
H  3.672834 -1.099743 3.094881
H  2.77808 0.39255 3.403289
H  1.935491 -1.001806 2.782767
H  5.141449 -0.037514 -1.399864
H  0.32461 -2.986268 -2.575343
H  -2.840903 -4.68821 -0.210482
H  -0.793092 -4.975095 -1.586695
totalener: -1461.17180920 hartree
nucrepener: 2132.15064702 hartree
electener: -3593.32245622 hartree
oneelecener: -6242.19200409 hartree
twoeener: 2648.86954787 hartree
kineticenergy: 1456.19196574 hartree
xcener: -118.608912776498 hartree
chargesum: -0.0000000
charge: 0.034250 -0.202113 -0.202604 -0.220872 -0.285618 -0.096975 0.259756 -0.163503 -0.070365 0.264175 -0.293061 -0.077184 -0.185129 0.066722 -0.191040 -0.107870 -0.183827 -0.175539 0.283325 0.309874 -0.196358 -0.204892 -0.073915 0.106345 0.104153 0.072331 0.089776 0.098259 0.098356 0.086536 0.086503 0.081731 0.113939 0.074979 0.097320 0.102038 0.122561 0.124726 0.123127 0.130084
qa: 0.0343 -0.2021 -0.2026 -0.2209 -0.2856 -0.0970 0.2598 -0.1635 -0.0704 0.2642 -0.2931 -0.0772 -0.1851 0.0667 -0.1910 -0.1079 -0.1838 -0.1755 0.2833 0.3099 -0.1964 -0.2049 -0.0739 0.1063 0.1042 0.0723 0.0898 0.0983 0.0984 0.0865 0.0865 0.0817 0.1139 0.0750 0.0973 0.1020 0.1226 0.1247 0.1231 0.1301
va: 2.7734 1.0943 1.0960 2.0531 2.0140 2.9781 3.9107 3.9487 4.0339 3.5323 3.9680 3.6586 3.8980 3.9123 3.7317 3.9607 3.9350 4.0488 3.9209 3.9049 3.9908 3.9749 3.8815 1.0113 1.0183 0.9941 1.0041 1.0106 1.0086 1.0036 0.9922 1.0040 1.0107 1.0025 1.0075 1.0063 1.0103 1.0092 1.0093 0.9969
dispcorr: -0.019297712 hartree
energy: -1461.191106909117
dipole: 4.68129 -4.68713 -0.00584 10.45352 -10.50954 -0.05602 7.14102 -8.24045 -1.09944
magnitude: 1.10088 au
magnitude: 2.79821 debye
