program: Orca
programVersion: 5.0.2
elementType: S F F O O N C C C C C C C C C C C C C C C C C H H H H H H H H H H H H H H H H H
charge: 0
multiplicity: 1
keywords: wb97x-d3
keywords: def2-TZVPP
keywords: def2/J RIJCOSX
keywords: DEFGRID2
keywords: scfconv7
keywords: smallprint printgap noloewdin
keywords: NOSOSCF
formula: C17H17F2NO2S
InChI: InChI=1/C17H17F2NO2S/c1-11-6-7-23-16(11)15-8-17(2,22-20-15)10-21-9-12-13(18)4-3-5-14(12)19/h3-7H,8-10H2,1-2H3
40 atoms
S  2.759118 0.479129 -1.151848
F  -3.861924 -2.269453 0.535867
F  -0.483774 -0.540592 -2.201357
O  -0.455298 2.376406 1.978985
O  -1.782296 0.781361 0.094607
N  0.5780 1.492184 1.959303
C  -0.749651 2.844179 0.647468
C  0.464904 2.397584 -0.170846
C  -2.021411 2.1540 0.171429
C  1.105033 1.451412 0.799062
C  -0.945253 4.347494 0.701968
C  2.225254 0.595135 0.485265
C  2.979747 -0.197202 1.318933
C  -2.726413 0.060136 -0.648381
C  -2.199232 -1.33293 -0.821458
C  3.992566 -0.885312 0.601208
C  2.77453 -0.330378 2.791923
C  3.994844 -0.617861 -0.733314
C  -2.762424 -2.439504 -0.205184
C  -1.055913 -1.572932 -1.574128
C  -2.245975 -3.71603 -0.326283
C  -0.494851 -2.824319 -1.720692
C  -1.103698 -3.897003 -1.087249
H  1.143728 3.223366 -0.405574
H  0.194075 1.918829 -1.112911
H  -2.293124 2.567691 -0.813176
H  -2.84962 2.382301 0.858509
H  -0.051764 4.836395 1.088688
H  -1.144553 4.74769 -0.292623
H  -1.781474 4.617284 1.348004
H  -2.883344 0.522645 -1.633504
H  -3.702345 0.044272 -0.151136
H  4.696383 -1.557448 1.071948
H  1.800116 -0.762159 3.019926
H  3.543343 -0.964057 3.232047
H  2.80132 0.638833 3.289513
H  4.660479 -1.008334 -1.48615
H  -2.7291 -4.544058 0.173183
H  0.400803 -2.949764 -2.312596
H  -0.680646 -4.88688 -1.188002
totalener: -1461.17091125 hartree
nucrepener: 2163.87487186 hartree
electener: -3625.04578311 hartree
oneelecener: -6305.68697470 hartree
twoeener: 2680.64119158 hartree
kineticenergy: 1456.19514740 hartree
xcener: -118.609645030739 hartree
chargesum: 0.0000000
charge: 0.033658 -0.202405 -0.203979 -0.224535 -0.285793 -0.097510 0.274843 -0.168875 -0.078933 0.253104 -0.287937 -0.074340 -0.172752 0.060770 -0.176707 -0.107640 -0.184996 -0.178469 0.307506 0.276010 -0.205210 -0.187898 -0.073658 0.105157 0.102482 0.071053 0.090377 0.096331 0.086917 0.098363 0.086494 0.083000 0.114446 0.103139 0.075230 0.096195 0.122769 0.122866 0.121428 0.129500
qa: 0.0337 -0.2024 -0.2040 -0.2245 -0.2858 -0.0975 0.2748 -0.1689 -0.0789 0.2531 -0.2879 -0.0743 -0.1728 0.0608 -0.1767 -0.1076 -0.1850 -0.1785 0.3075 0.2760 -0.2052 -0.1879 -0.0737 0.1052 0.1025 0.0711 0.0904 0.0963 0.0869 0.0984 0.0865 0.0830 0.1144 0.1031 0.0752 0.0962 0.1228 0.1229 0.1214 0.1295
va: 2.7700 1.0966 1.0906 2.0498 2.0137 2.9648 3.8915 3.9571 4.0404 3.5332 3.9574 3.6507 3.8871 3.9166 3.7205 3.9572 3.9340 4.0420 3.9124 3.9079 3.9734 3.9904 3.8844 1.0127 1.0163 0.9957 1.0044 1.0104 1.0034 1.0104 0.9927 1.0033 1.0107 1.0060 1.0024 1.0081 1.0102 1.0092 1.0119 0.9969
dispcorr: -0.020356367 hartree
energy: -1461.191267620628
dipole: 5.21694 -5.20810 0.00884 11.14755 -11.33573 -0.18818 6.03389 -7.17630 -1.14241
magnitude: 1.15784 au
magnitude: 2.94299 debye
