program: Orca
programVersion: 5.0.2
elementType: S F F O O N C C C C C C C C C C C C C C C C C H H H H H H H H H H H H H H H H H
charge: 0
multiplicity: 1
keywords: wb97x-d3
keywords: def2-TZVPP
keywords: def2/J RIJCOSX
keywords: DEFGRID2
keywords: scfconv7
keywords: smallprint printgap noloewdin
keywords: NOSOSCF
formula: C17H17F2NO2S
InChI: InChI=1/C17H17F2NO2S/c1-11-6-7-23-16(11)15-8-17(2,22-20-15)10-21-9-12-13(18)4-3-5-14(12)19/h3-7H,8-10H2,1-2H3
40 atoms
S  3.366736 0.426456 2.31314
F  -0.861588 -0.677038 -2.800225
F  -3.914563 -1.803535 0.56194
O  -0.447775 2.378739 1.892535
O  -2.253335 1.231454 -1.001903
N  0.715289 1.690366 2.052397
C  -0.829855 2.383772 0.503968
C  0.449965 1.976512 -0.2292
C  -1.903099 1.306509 0.355097
C  1.243343 1.433042 0.920053
C  -1.344176 3.761717 0.14218
C  2.513029 0.743461 0.846637
C  3.194493 0.269661 -0.24991
C  -3.098114 0.164214 -1.334182
C  -2.43903 -1.179882 -1.145772
C  4.416696 -0.350135 0.128302
C  2.755075 0.34816 -1.681044
C  4.636173 -0.336817 1.469788
C  -1.32194 -1.542272 -1.888725
C  -2.8600 -2.106505 -0.202696
C  -0.662742 -2.743714 -1.732622
C  -2.238829 -3.325887 -0.006635
C  -1.13526 -3.636548 -0.78242
H  0.968898 2.826429 -0.684243
H  0.260173 1.256431 -1.022823
H  -2.772949 1.557964 0.978428
H  -1.502595 0.351111 0.723079
H  -2.208494 4.031758 0.749964
H  -0.571635 4.514421 0.298977
H  -1.646319 3.792843 -0.90353
H  -3.361758 0.3017 -2.383852
H  -4.031611 0.202757 -0.762882
H  5.101858 -0.787124 -0.584451
H  3.51724 -0.07663 -2.333356
H  1.833615 -0.206559 -1.86164
H  2.58931 1.373857 -2.010116
H  5.484492 -0.739347 2.000207
H  0.199192 -2.97371 -2.343123
H  -2.611226 -4.008817 0.743993
H  -0.632585 -4.583546 -0.642936
totalener: -1461.17195408 hartree
nucrepener: 2136.82684998 hartree
electener: -3597.99880406 hartree
oneelecener: -6250.82728408 hartree
twoeener: 2652.82848002 hartree
kineticenergy: 1456.19099262 hartree
xcener: -118.611573612458 hartree
chargesum: -0.0000000
charge: 0.085535 -0.199399 -0.201222 -0.223019 -0.312130 -0.091534 0.306964 -0.149290 -0.121780 0.159064 -0.285221 -0.056272 -0.128512 0.051628 -0.179502 -0.128269 -0.254391 -0.166907 0.215881 0.320292 -0.182645 -0.185960 -0.078560 0.091659 0.111670 0.098527 0.110073 0.090116 0.091109 0.099313 0.105876 0.097194 0.111563 0.088548 0.093244 0.107078 0.121893 0.127344 0.127168 0.132876
qa: 0.0855 -0.1994 -0.2012 -0.2230 -0.3121 -0.0915 0.3070 -0.1493 -0.1218 0.1591 -0.2852 -0.0563 -0.1285 0.0516 -0.1795 -0.1283 -0.2544 -0.1669 0.2159 0.3203 -0.1826 -0.1860 -0.0786 0.0917 0.1117 0.0985 0.1101 0.0901 0.0911 0.0993 0.1059 0.0972 0.1116 0.0885 0.0932 0.1071 0.1219 0.1273 0.1272 0.1329
va: 2.8134 1.0970 1.0910 2.0474 1.9791 2.9739 3.9516 3.9350 4.0691 3.6310 3.9304 3.6369 3.7653 3.9154 3.5742 3.9746 3.9435 4.0490 3.9471 3.8532 3.9617 3.9700 3.8965 1.0093 1.0205 1.0064 0.9894 1.0119 1.0108 1.0135 0.9917 1.0109 1.0127 1.0081 0.9970 0.9912 1.0099 1.0074 1.0077 0.9967
dispcorr: -0.021041731 hartree
energy: -1461.192995814679
dipole: 4.82133 -4.70034 0.12098 7.88938 -8.85996 -0.97058 -7.62940 6.31686 -1.31254
magnitude: 1.63689 au
magnitude: 4.16065 debye
