program: Orca
programVersion: 5.0.2
elementType: S F F O O N C C C C C C C C C C C C C C C C C H H H H H H H H H H H H H H H H H
charge: 0
multiplicity: 1
keywords: wb97x-d3
keywords: def2-TZVPP
keywords: def2/J RIJCOSX
keywords: DEFGRID2
keywords: scfconv7
keywords: smallprint printgap noloewdin
keywords: NOSOSCF
formula: C17H17F2NO2S
InChI: InChI=1/C17H17F2NO2S/c1-11-6-7-23-16(11)15-8-17(2,22-20-15)10-21-9-12-13(18)4-3-5-14(12)19/h3-7H,8-10H2,1-2H3
40 atoms
S  2.973676 1.109977 -0.95517
F  -0.454355 -0.498034 -2.329537
F  -3.764464 -2.472817 0.325928
O  -0.64875 2.067567 2.159576
O  -1.787115 0.663531 0.044933
N  0.472887 1.305426 2.075989
C  -0.931217 2.702331 0.896334
C  0.342262 2.471166 0.077088
C  -2.12912 1.99639 0.276441
C  1.045972 1.477637 0.95024
C  -1.243318 4.16431 1.156105
C  2.262092 0.7905 0.584011
C  2.992269 -0.132913 1.295386
C  -2.708633 -0.04595 -0.736942
C  -2.138488 -1.410618 -0.985994
C  4.131686 -0.562226 0.566317
C  2.644719 -0.636495 2.657181
C  4.251109 0.021695 -0.656994
C  -0.991827 -1.57628 -1.753627
C  -2.661988 -2.5653 -0.424543
C  -0.391691 -2.800113 -1.96472
C  -2.103408 -3.816065 -0.608606
C  -0.959631 -3.921826 -1.381186
H  0.940627 3.380235 -0.036613
H  0.144756 2.079667 -0.922211
H  -2.39379 2.512141 -0.660627
H  -2.997041 2.078747 0.947392
H  -1.448109 4.689393 0.222427
H  -2.113309 4.276953 1.803934
H  -0.399976 4.655958 1.639921
H  -2.885118 0.465932 -1.693628
H  -3.681126 -0.120662 -0.238328
H  4.83748 -1.28654 0.948424
H  3.378512 -1.367468 2.994768
H  2.606223 0.17266 3.386306
H  1.66027 -1.104113 2.668485
H  5.022396 -0.136273 -1.393197
H  0.502857 -2.866797 -2.567738
H  -2.556681 -4.682513 -0.147867
H  -0.504397 -4.890793 -1.531717
totalener: -1461.17170048 hartree
nucrepener: 2147.73305389 hartree
electener: -3608.90475437 hartree
oneelecener: -6273.38577930 hartree
twoeener: 2664.48102492 hartree
kineticenergy: 1456.19936166 hartree
xcener: -118.610391550739 hartree
chargesum: -0.0000000
charge: 0.034338 -0.202761 -0.202452 -0.223502 -0.283994 -0.097050 0.265646 -0.162819 -0.074120 0.257750 -0.289950 -0.074648 -0.180899 0.063913 -0.189868 -0.107764 -0.182862 -0.177111 0.284151 0.309618 -0.194766 -0.204776 -0.074391 0.106675 0.102757 0.072211 0.089560 0.086939 0.098354 0.097043 0.086666 0.081866 0.113408 0.074296 0.098198 0.101142 0.122608 0.123936 0.122879 0.129777
qa: 0.0343 -0.2028 -0.2025 -0.2235 -0.2840 -0.0970 0.2656 -0.1628 -0.0741 0.2577 -0.2900 -0.0746 -0.1809 0.0639 -0.1899 -0.1078 -0.1829 -0.1771 0.2842 0.3096 -0.1948 -0.2048 -0.0744 0.1067 0.1028 0.0722 0.0896 0.0869 0.0984 0.0970 0.0867 0.0819 0.1134 0.0743 0.0982 0.1011 0.1226 0.1239 0.1229 0.1298
va: 2.7716 1.0929 1.0963 2.0513 2.0156 2.9732 3.9103 3.9474 4.0349 3.5365 3.9604 3.6553 3.8927 3.9161 3.7306 3.9601 3.9331 4.0480 3.9141 3.9070 3.9892 3.9732 3.8817 1.0114 1.0178 0.9947 1.0040 1.0035 1.0104 1.0097 0.9926 1.0038 1.0108 1.0023 1.0073 1.0072 1.0103 1.0094 1.0092 0.9969
dispcorr: -0.019700301 hartree
energy: -1461.191400781586
dipole: 3.90016 -3.88940 0.01075 10.01857 -10.08943 -0.07086 6.99264 -8.09496 -1.10232
magnitude: 1.10465 au
magnitude: 2.80779 debye
