program: Orca
programVersion: 5.0.2
elementType: S F F O O N C C C C C C C C C C C C C C C C C H H H H H H H H H H H H H H H H H
charge: 0
multiplicity: 1
keywords: wb97x-d3
keywords: def2-TZVPP
keywords: def2/J RIJCOSX
keywords: DEFGRID2
keywords: scfconv7
keywords: smallprint printgap noloewdin
keywords: NOSOSCF
formula: C17H17F2NO2S
InChI: InChI=1/C17H17F2NO2S/c1-11-6-7-23-16(11)15-8-17(2,22-20-15)10-21-9-12-13(18)4-3-5-14(12)19/h3-7H,8-10H2,1-2H3
40 atoms
S  2.954267 1.085266 -0.960185
F  -0.480164 -0.462089 -2.341657
F  -3.7208 -2.500262 0.349599
O  -0.649437 2.082391 2.164087
O  -1.793111 0.664218 0.058849
N  0.467386 1.312739 2.080463
C  -0.935078 2.707808 0.896801
C  0.336186 2.469423 0.076346
C  -2.135147 1.997956 0.284996
C  1.036831 1.475176 0.951331
C  -1.245942 4.171847 1.146242
C  2.246278 0.777329 0.583181
C  2.971657 -0.149635 1.294879
C  -2.715096 -0.051628 -0.716839
C  -2.129626 -1.407308 -0.979256
C  4.104768 -0.590723 0.562932
C  2.625122 -0.646126 2.659616
C  4.224092 -0.012238 -0.66302
C  -0.990364 -1.551573 -1.76191
C  -2.62665 -2.572231 -0.41508
C  -0.371571 -2.764112 -1.983821
C  -2.048946 -3.812782 -0.60961
C  -0.91297 -3.896904 -1.396279
H  0.938403 3.375774 -0.039554
H  0.135741 2.077112 -0.922039
H  -2.403415 2.508505 -0.653907
H  -3.000498 2.08364 0.95886
H  -2.114745 4.289812 1.794756
H  -0.40151 4.666785 1.624809
H  -1.452205 4.689845 0.208941
H  -2.907724 0.463051 -1.668931
H  -3.681163 -0.140801 -0.208164
H  4.806149 -1.319331 0.94497
H  2.59825 0.165334 3.386855
H  1.635909 -1.1036 2.676551
H  3.352898 -1.383751 2.995834
H  4.991403 -0.178805 -1.401533
H  0.516631 -2.813885 -2.597779
H  -2.481559 -4.688127 -0.14577
H  -0.442999 -4.857583 -1.554755
totalener: -1461.17167952 hartree
nucrepener: 2150.28394254 hartree
electener: -3611.45562206 hartree
oneelecener: -6278.48765802 hartree
twoeener: 2667.03203596 hartree
kineticenergy: 1456.19635515 hartree
xcener: -118.609817488397 hartree
chargesum: -0.0000000
charge: 0.034386 -0.203206 -0.202334 -0.223762 -0.283879 -0.096917 0.266588 -0.163301 -0.074577 0.256624 -0.289634 -0.074378 -0.180197 0.063100 -0.189036 -0.107801 -0.182875 -0.177312 0.283505 0.309025 -0.193702 -0.204544 -0.074284 0.106819 0.102771 0.072251 0.089367 0.098359 0.096887 0.086976 0.086691 0.082186 0.113409 0.098302 0.101153 0.074278 0.122646 0.123721 0.122926 0.129770
qa: 0.0344 -0.2032 -0.2023 -0.2238 -0.2839 -0.0969 0.2666 -0.1633 -0.0746 0.2566 -0.2896 -0.0744 -0.1802 0.0631 -0.1890 -0.1078 -0.1829 -0.1773 0.2835 0.3090 -0.1937 -0.2045 -0.0743 0.1068 0.1028 0.0723 0.0894 0.0984 0.0969 0.0870 0.0867 0.0822 0.1134 0.0983 0.1012 0.0743 0.1226 0.1237 0.1229 0.1298
va: 2.7713 1.0922 1.0964 2.0513 2.0152 2.9728 3.9091 3.9477 4.0353 3.5376 3.9596 3.6549 3.8922 3.9165 3.7274 3.9601 3.9330 4.0475 3.9131 3.9080 3.9893 3.9723 3.8820 1.0115 1.0177 0.9949 1.0039 1.0103 1.0099 1.0035 0.9927 1.0037 1.0108 1.0072 1.0072 1.0023 1.0102 1.0096 1.0092 0.9969
dispcorr: -0.019784424 hartree
energy: -1461.191463946212
dipole: 3.87063 -3.85603 0.01460 10.00919 -10.08557 -0.07638 6.95456 -8.06396 -1.10940
magnitude: 1.11212 au
magnitude: 2.82678 debye
