program: Orca
programVersion: 5.0.2
elementType: S F F O O N C C C C C C C C C C C C C C C C C H H H H H H H H H H H H H H H H H
charge: 0
multiplicity: 1
keywords: wb97x-d3
keywords: def2-TZVPP
keywords: def2/J RIJCOSX
keywords: DEFGRID2
keywords: scfconv7
keywords: smallprint printgap noloewdin
keywords: NOSOSCF
formula: C17H17F2NO2S
InChI: InChI=1/C17H17F2NO2S/c1-11-6-7-23-16(11)15-8-17(2,22-20-15)10-21-9-12-13(18)4-3-5-14(12)19/h3-7H,8-10H2,1-2H3
40 atoms
S  2.527533 0.557525 -1.297402
F  -1.214044 -0.172679 -2.775222
F  -2.359891 -2.115304 1.326416
O  -0.351609 2.360703 2.185297
O  -2.632044 1.175649 -0.344073
N  0.703209 1.499362 2.042948
C  -1.03939 2.465768 0.922825
C  0.058089 2.147049 -0.083737
C  -2.103697 1.358837 0.944744
C  0.947388 1.323874 0.80073
C  -1.64335 3.845717 0.793392
C  1.967402 0.417155 0.328113
C  2.581118 -0.621398 0.986845
C  -3.028447 -0.142155 -0.634313
C  -1.858266 -1.093687 -0.723684
C  3.505518 -1.293096 0.143791
C  2.308129 -1.019275 2.399509
C  3.58112 -0.7689 -1.110234
C  -0.973062 -1.049096 -1.793882
C  -1.549325 -2.01953 0.264929
C  0.1441 -1.851943 -1.895072
C  -0.440549 -2.842226 0.219185
C  0.407318 -2.747516 -0.871574
H  0.586016 3.045018 -0.424682
H  -0.304694 1.625856 -0.966689
H  -2.895955 1.626672 1.656454
H  -1.633411 0.444473 1.321578
H  -0.87104 4.614698 0.783596
H  -2.210874 3.91824 -0.133979
H  -2.32363 4.056054 1.619281
H  -3.544104 -0.097525 -1.593793
H  -3.753249 -0.511977 0.097974
H  4.094585 -2.139311 0.469404
H  2.702828 -0.288072 3.104561
H  1.237393 -1.085731 2.593424
H  2.76032 -1.984826 2.622738
H  4.211905 -1.088626 -1.924279
H  0.795551 -1.766381 -2.752458
H  -0.248104 -3.53584 1.025728
H  1.287133 -3.37251 -0.924469
totalener: -1461.17084697 hartree
nucrepener: 2268.03176777 hartree
electener: -3729.20261474 hartree
oneelecener: -6513.31000530 hartree
twoeener: 2784.10739056 hartree
kineticenergy: 1456.19548696 hartree
xcener: -118.615992987864 hartree
chargesum: 0.0000000
charge: 0.035018 -0.197510 -0.204093 -0.229129 -0.324528 -0.093924 0.335737 -0.202865 -0.138036 0.127869 -0.269444 0.029761 -0.184127 0.055993 -0.141260 -0.141853 -0.203940 -0.156052 0.230406 0.302732 -0.211011 -0.206254 -0.053636 0.109130 0.130250 0.095731 0.113544 0.086444 0.099762 0.090865 0.103958 0.097906 0.119138 0.115067 0.094406 0.079534 0.127052 0.124827 0.126023 0.126514
qa: 0.0350 -0.1975 -0.2041 -0.2291 -0.3245 -0.0939 0.3357 -0.2029 -0.1380 0.1279 -0.2694 0.0298 -0.1841 0.0560 -0.1413 -0.1419 -0.2039 -0.1561 0.2304 0.3027 -0.2110 -0.2063 -0.0536 0.1091 0.1302 0.0957 0.1135 0.0864 0.0998 0.0909 0.1040 0.0979 0.1191 0.1151 0.0944 0.0795 0.1271 0.1248 0.1260 0.1265
va: 2.7490 1.0994 1.0854 2.0448 1.9773 2.9421 3.8607 3.9203 4.0726 3.6195 3.9081 3.6188 3.8456 3.9154 3.5505 3.9395 3.9396 4.0044 3.8957 3.8287 3.8923 3.9150 3.8111 1.0125 1.0205 1.0069 0.9796 1.0137 1.0102 1.0110 0.9939 1.0033 1.0098 1.0034 1.0069 1.0013 1.0068 1.0143 1.0079 1.0033
dispcorr: -0.026421762 hartree
energy: -1461.197268731418
dipole: 2.69662 -2.34708 0.34955 5.04500 -5.89622 -0.85123 7.42385 -8.19638 -0.77253
magnitude: 1.20149 au
magnitude: 3.05395 debye
