program: Orca
programVersion: 5.0.2
elementType: S F F O O N C C C C C C C C C C C C C C C C C H H H H H H H H H H H H H H H H H
charge: 0
multiplicity: 1
keywords: wb97x-d3
keywords: def2-TZVPP
keywords: def2/J RIJCOSX
keywords: DEFGRID2
keywords: scfconv7
keywords: smallprint printgap noloewdin
keywords: NOSOSCF
formula: C17H17F2NO2S
InChI: InChI=1/C17H17F2NO2S/c1-11-6-7-23-16(11)15-8-17(2,22-20-15)10-21-9-12-13(18)4-3-5-14(12)19/h3-7H,8-10H2,1-2H3
40 atoms
S  2.338032 -0.950822 1.926447
F  -3.203297 -1.403392 0.84562
F  -0.433841 -0.280146 -2.75935
O  -1.408561 1.112236 1.431167
O  -2.280549 1.569735 -1.513277
N  -0.257319 0.406984 1.567952
C  -1.191862 2.276699 0.605822
C  0.176088 2.023837 -0.035565
C  -2.345279 2.398603 -0.390592
C  0.636684 0.849724 0.77431
C  -1.181853 3.491609 1.523955
C  1.934116 0.212074 0.717426
C  2.927329 0.331249 -0.224467
C  -2.840971 0.282584 -1.423415
C  -1.869781 -0.778445 -0.975511
C  4.018937 -0.534068 0.060356
C  2.897559 1.204893 -1.442139
C  3.838534 -1.277868 1.184059
C  -2.082359 -1.575715 0.139217
C  -0.687702 -1.01516 -1.66586
C  -1.187042 -2.537896 0.562721
C  0.242534 -1.958686 -1.283505
C  -0.019819 -2.721255 -0.156519
H  0.844782 2.880196 0.072241
H  0.112815 1.787976 -1.098692
H  -2.343471 3.422681 -0.774958
H  -3.290015 2.266123 0.155883
H  -0.967528 4.402067 0.962611
H  -2.143884 3.619233 2.022624
H  -0.419132 3.384179 2.295652
H  -3.197031 0.040404 -2.427583
H  -3.717683 0.281726 -0.769413
H  4.904148 -0.590729 -0.557581
H  2.74672 2.255979 -1.197361
H  3.840568 1.134569 -1.98219
H  2.106641 0.911534 -2.133572
H  4.520447 -1.994056 1.614377
H  -1.397531 -3.114669 1.45204
H  1.153409 -2.086021 -1.851631
H  0.700964 -3.457899 0.168909
totalener: -1461.16710578 hartree
nucrepener: 2290.97232515 hartree
electener: -3752.13943093 hartree
oneelecener: -6559.90024342 hartree
twoeener: 2807.76081249 hartree
kineticenergy: 1456.20891113 hartree
xcener: -118.622089161026 hartree
chargesum: 0.0000000
charge: 0.071615 -0.204618 -0.204950 -0.224648 -0.313634 -0.087733 0.263466 -0.185899 -0.022887 0.201743 -0.316457 -0.073392 -0.147846 0.028644 -0.138965 -0.131908 -0.248461 -0.166749 0.318168 0.231366 -0.128393 -0.161813 -0.144770 0.108444 0.122925 0.091132 0.083552 0.079342 0.102392 0.106744 0.105258 0.094622 0.113837 0.100462 0.091104 0.103077 0.123881 0.115085 0.119026 0.127235
qa: 0.0716 -0.2046 -0.2050 -0.2246 -0.3136 -0.0877 0.2635 -0.1859 -0.0229 0.2017 -0.3165 -0.0734 -0.1478 0.0286 -0.1390 -0.1319 -0.2485 -0.1667 0.3182 0.2314 -0.1284 -0.1618 -0.1448 0.1084 0.1229 0.0911 0.0836 0.0793 0.1024 0.1067 0.1053 0.0946 0.1138 0.1005 0.0911 0.1031 0.1239 0.1151 0.1190 0.1272
va: 2.7902 1.0921 1.0885 2.0342 2.0072 2.9090 3.8287 3.9785 3.9742 3.5306 3.9833 3.6029 3.7535 3.9526 3.5842 3.9721 3.9400 4.0342 3.8772 3.8849 3.9192 3.8871 3.8876 1.0080 1.0240 0.9990 1.0112 1.0074 1.0091 1.0036 0.9909 1.0116 1.0120 0.9928 1.0076 1.0019 1.0088 1.0100 1.0082 1.0044
dispcorr: -0.026944260 hartree
energy: -1461.194050037389
dipole: 7.07497 -6.32775 0.74721 15.44011 -14.97341 0.46670 -2.80894 2.38608 -0.42287
magnitude: 0.97721 au
magnitude: 2.48388 debye
