program: Orca
programVersion: 5.0.2
elementType: S F F O O N C C C C C C C C C C C C C C C C C H H H H H H H H H H H H H H H H H
charge: 0
multiplicity: 1
keywords: wb97x-d3
keywords: def2-TZVPP
keywords: def2/J RIJCOSX
keywords: DEFGRID2
keywords: scfconv7
keywords: smallprint printgap noloewdin
keywords: NOSOSCF
formula: C17H17F2NO2S
InChI: InChI=1/C17H17F2NO2S/c1-11-6-7-23-16(11)15-8-17(2,22-20-15)10-21-9-12-13(18)4-3-5-14(12)19/h3-7H,8-10H2,1-2H3
40 atoms
S  3.552852 0.853215 -1.033894
F  -4.640228 -1.382791 0.552655
F  -0.572619 -2.23286 -1.596167
O  -0.116838 1.957625 1.972194
O  -0.967545 -0.436979 0.745639
N  1.196102 1.622533 2.019645
C  -0.619558 1.904897 0.620133
C  0.626398 1.627475 -0.229426
C  -1.63366 0.775421 0.548482
C  1.650954 1.423958 0.845052
C  -1.282699 3.234351 0.305186
C  3.026249 1.059397 0.596369
C  4.048613 0.832989 1.488669
C  -1.800575 -1.559733 0.82621
C  -2.565409 -1.815004 -0.449485
C  5.253129 0.494426 0.81853
C  3.927242 0.923917 2.974205
C  5.136632 0.467464 -0.537026
C  -3.945373 -1.705976 -0.544709
C  -1.902484 -2.128845 -1.630411
C  -4.644056 -1.911222 -1.71992
C  -2.549847 -2.339691 -2.830867
C  -3.931674 -2.22955 -2.863793
H  0.891544 2.472995 -0.871175
H  0.525481 0.748264 -0.869063
H  -2.132376 0.809392 -0.431629
H  -2.410639 0.935609 1.310897
H  -1.663643 3.243325 -0.716721
H  -2.116921 3.433216 0.978863
H  -0.56883 4.051572 0.405344
H  -2.498468 -1.472809 1.66585
H  -1.146129 -2.405417 1.041574
H  6.175804 0.276619 1.337978
H  3.159093 0.250287 3.353687
H  4.872905 0.672975 3.452933
H  3.637273 1.925657 3.291238
H  5.90011 0.238555 -1.26289
H  -5.721107 -1.81879 -1.732676
H  -1.981435 -2.586261 -3.716879
H  -4.458623 -2.392491 -3.793743
totalener: -1461.17252600 hartree
nucrepener: 2086.80171621 hartree
electener: -3547.97424220 hartree
oneelecener: -6151.22877270 hartree
twoeener: 2603.25453049 hartree
kineticenergy: 1456.19660290 hartree
xcener: -118.611922403230 hartree
chargesum: 0.0000000
charge: 0.032215 -0.202603 -0.191033 -0.220570 -0.281080 -0.101201 0.260545 -0.151990 -0.070622 0.268092 -0.294273 -0.078650 -0.191978 0.033924 -0.236233 -0.106677 -0.183408 -0.172942 0.341757 0.270441 -0.203087 -0.205658 -0.073304 0.103299 0.110195 0.071760 0.091933 0.085569 0.098574 0.099492 0.097663 0.101626 0.114093 0.099847 0.075933 0.097686 0.122654 0.126905 0.128221 0.132886
qa: 0.0322 -0.2026 -0.1910 -0.2206 -0.2811 -0.1012 0.2605 -0.1520 -0.0706 0.2681 -0.2943 -0.0787 -0.1920 0.0339 -0.2362 -0.1067 -0.1834 -0.1729 0.3418 0.2704 -0.2031 -0.2057 -0.0733 0.1033 0.1102 0.0718 0.0919 0.0856 0.0986 0.0995 0.0977 0.1016 0.1141 0.0998 0.0759 0.0977 0.1227 0.1269 0.1282 0.1329
va: 2.7756 1.0896 1.1093 2.0499 2.0085 2.9851 3.9169 3.9291 4.0290 3.5423 3.9712 3.6773 3.9059 3.9334 3.5805 3.9624 3.9349 4.0495 3.8191 3.9339 3.9731 3.9762 3.8709 1.0102 1.0218 0.9892 1.0048 1.0042 1.0101 1.0080 1.0079 0.9916 1.0108 1.0072 1.0025 1.0069 1.0105 1.0085 1.0082 0.9966
dispcorr: -0.019177849 hartree
energy: -1461.191703844851
dipole: 5.14220 -5.80575 -0.66355 11.10373 -11.38469 -0.28095 4.24291 -5.64651 -1.40360
magnitude: 1.57776 au
magnitude: 4.01034 debye
