program: Orca
programVersion: 5.0.2
elementType: S F F O O N C C C C C C C C C C C C C C C C C H H H H H H H H H H H H H H H H H
charge: 0
multiplicity: 1
keywords: wb97x-d3
keywords: def2-TZVPP
keywords: def2/J RIJCOSX
keywords: DEFGRID2
keywords: scfconv7
keywords: smallprint printgap noloewdin
keywords: NOSOSCF
formula: C17H17F2NO2S
InChI: InChI=1/C17H17F2NO2S/c1-11-6-7-23-16(11)15-8-17(2,22-20-15)10-21-9-12-13(18)4-3-5-14(12)19/h3-7H,8-10H2,1-2H3
40 atoms
S  3.7716 0.323284 -0.66832
F  -0.78512 -2.828846 -0.786658
F  -4.764127 -0.45467 -0.155785
O  -0.114685 2.355185 1.464897
O  -1.163077 -0.123168 0.662575
N  1.130202 1.918284 1.772182
C  -0.443467 2.066077 0.089499
C  0.846942 1.467945 -0.48537
C  -1.598035 1.076985 0.092833
C  1.698168 1.416664 0.746528
C  -0.853536 3.365002 -0.583283
C  3.037561 0.877246 0.791624
C  3.878306 0.721797 1.8693
C  -2.17458 -1.068456 0.882687
C  -2.742984 -1.613082 -0.404319
C  5.119105 0.153738 1.478484
C  3.545104 1.090867 3.277137
C  5.204955 -0.110067 0.146245
C  -1.991839 -2.455141 -1.215656
C  -3.994505 -1.26557 -0.891718
C  -2.436438 -2.931705 -2.432309
C  -4.487552 -1.710805 -2.104197
C  -3.693542 -2.546089 -2.871994
H  1.296452 2.106748 -1.251316
H  0.706228 0.478294 -0.924546
H  -1.945392 0.934226 -0.941298
H  -2.437645 1.506305 0.658801
H  -1.088027 3.199988 -1.63559
H  -1.73072 3.80336 -0.105861
H  -0.044904 4.093805 -0.530114
H  -2.977602 -0.650148 1.498941
H  -1.717089 -1.873214 1.458229
H  5.91924 -0.051704 2.1758
H  4.355302 0.81174 3.949446
H  3.368139 2.161797 3.379356
H  2.632615 0.598544 3.613035
H  6.034444 -0.540065 -0.391499
H  -1.809297 -3.588529 -3.019131
H  -5.470268 -1.40509 -2.435404
H  -4.059077 -2.904198 -3.824482
totalener: -1461.17296920 hartree
nucrepener: 2081.73192717 hartree
electener: -3542.90489637 hartree
oneelecener: -6141.07858625 hartree
twoeener: 2598.17368987 hartree
kineticenergy: 1456.19210570 hartree
xcener: -118.610803843746 hartree
chargesum: 0.0000000
charge: 0.031499 -0.192355 -0.202109 -0.219557 -0.283527 -0.101240 0.250235 -0.149717 -0.062554 0.265744 -0.295580 -0.078920 -0.188662 0.035773 -0.229032 -0.107951 -0.182549 -0.172813 0.270496 0.330921 -0.206277 -0.193356 -0.075656 0.103343 0.111680 0.074309 0.090595 0.085748 0.097628 0.100549 0.098395 0.099969 0.113741 0.075049 0.098490 0.099085 0.122887 0.127147 0.126327 0.132246
qa: 0.0315 -0.1924 -0.2021 -0.2196 -0.2835 -0.1012 0.2502 -0.1497 -0.0626 0.2657 -0.2956 -0.0789 -0.1887 0.0358 -0.2290 -0.1080 -0.1825 -0.1728 0.2705 0.3309 -0.2063 -0.1934 -0.0757 0.1033 0.1117 0.0743 0.0906 0.0857 0.0976 0.1005 0.0984 0.1000 0.1137 0.0750 0.0985 0.0991 0.1229 0.1271 0.1263 0.1322
va: 2.7740 1.1082 1.0888 2.0525 2.0109 2.9818 3.9370 3.9230 4.0191 3.5496 3.9733 3.6813 3.9056 3.9317 3.5769 3.9656 3.9347 4.0494 3.9418 3.8168 3.9711 3.9678 3.8724 1.0095 1.0207 0.9898 1.0054 1.0045 1.0102 1.0076 1.0056 0.9942 1.0108 1.0026 1.0064 1.0076 1.0104 1.0082 1.0084 0.9967
dispcorr: -0.019023596 hartree
energy: -1461.191992798116
dipole: 6.03537 -6.52268 -0.48731 11.14957 -11.66508 -0.51552 2.42833 -3.81538 -1.38706
magnitude: 1.55793 au
magnitude: 3.95995 debye
