program: Orca
programVersion: 5.0.2
elementType: S F F O O N C C C C C C C C C C C C C C C C C H H H H H H H H H H H H H H H H H
charge: 0
multiplicity: 1
keywords: wb97x-d3
keywords: def2-TZVPP
keywords: def2/J RIJCOSX
keywords: DEFGRID2
keywords: scfconv7
keywords: smallprint printgap noloewdin
keywords: NOSOSCF
formula: C17H17F2NO2S
InChI: InChI=1/C17H17F2NO2S/c1-11-6-7-23-16(11)15-8-17(2,22-20-15)10-21-9-12-13(18)4-3-5-14(12)19/h3-7H,8-10H2,1-2H3
40 atoms
S  2.938234 1.181598 -0.795899
F  -0.079769 -0.166215 -2.039145
F  -3.29138 -2.663037 0.264172
O  -0.774314 2.239154 2.185079
O  -1.83073 0.707833 0.170866
N  0.276532 1.377225 2.064852
C  -1.081577 2.823992 0.904038
C  0.202337 2.605215 0.103027
C  -2.239215 2.036946 0.293175
C  0.82331 1.512478 0.921692
C  -1.460858 4.275659 1.113224
C  1.893391 0.652437 0.472301
C  2.199586 -0.622478 0.882276
C  -2.533829 -0.095601 -0.735986
C  -1.727781 -1.352464 -0.884569
C  3.305599 -1.145754 0.159181
C  1.449445 -1.393295 1.917857
C  3.802581 -0.289705 -0.774071
C  -0.477047 -1.316464 -1.488137
C  -2.10199 -2.570398 -0.338777
C  0.365316 -2.406104 -1.555418
C  -1.302236 -3.696809 -0.387581
C  -0.061889 -3.600795 -0.996488
H  0.844267 3.492793 0.088815
H  0.024608 2.311027 -0.931264
H  -2.484846 2.476915 -0.686067
H  -3.133241 2.12739 0.926955
H  -1.693101 4.754547 0.161353
H  -2.335164 4.369445 1.75835
H  -0.641621 4.825125 1.57565
H  -2.638931 0.404677 -1.708417
H  -3.546435 -0.318897 -0.383541
H  3.707299 -2.134846 0.330383
H  1.709274 -1.069478 2.926157
H  0.373681 -1.251661 1.813422
H  1.6667 -2.457779 1.835259
H  4.634313 -0.447164 -1.441949
H  1.335547 -2.310798 -2.022112
H  -1.645947 -4.622331 0.052741
H  0.581233 -4.46916 -1.036085
totalener: -1461.16782219 hartree
nucrepener: 2241.44097231 hartree
electener: -3702.60879451 hartree
oneelecener: -6460.76359093 hartree
twoeener: 2758.15479643 hartree
kineticenergy: 1456.20280430 hartree
xcener: -118.612024606767 hartree
chargesum: -0.0000000
charge: 0.040393 -0.203087 -0.202372 -0.224502 -0.282849 -0.079581 0.292540 -0.179510 -0.086748 0.158682 -0.281138 0.023209 -0.182257 0.046987 -0.187007 -0.158367 -0.209804 -0.157798 0.280969 0.311998 -0.176222 -0.190463 -0.093429 0.107501 0.105273 0.071416 0.090824 0.087197 0.098373 0.093960 0.088983 0.084823 0.117340 0.118170 0.098767 0.075553 0.125370 0.124088 0.123681 0.129035
qa: 0.0404 -0.2031 -0.2024 -0.2245 -0.2828 -0.0796 0.2925 -0.1795 -0.0867 0.1587 -0.2811 0.0232 -0.1823 0.0470 -0.1870 -0.1584 -0.2098 -0.1578 0.2810 0.3120 -0.1762 -0.1905 -0.0934 0.1075 0.1053 0.0714 0.0908 0.0872 0.0984 0.0940 0.0890 0.0848 0.1173 0.1182 0.0988 0.0756 0.1254 0.1241 0.1237 0.1290
va: 2.7634 1.0935 1.0966 2.0495 2.0149 2.9490 3.8958 3.9474 4.0377 3.6628 3.9383 3.6294 3.8576 3.9403 3.7055 3.9632 3.9396 4.0371 3.8740 3.9113 3.9225 3.9575 3.8683 1.0107 1.0191 0.9964 1.0047 1.0030 1.0104 1.0124 0.9943 1.0012 1.0106 1.0038 1.0119 1.0015 1.0082 1.0106 1.0077 0.9978
dispcorr: -0.024773942 hartree
energy: -1461.192596135078
dipole: -0.11384 0.08143 -0.03242 7.91482 -8.04345 -0.12863 4.52417 -5.76779 -1.24362
magnitude: 1.25067 au
magnitude: 3.17895 debye
