program: Orca
programVersion: 5.0.2
elementType: S F F O O N C C C C C C C C C C C C C C C C C H H H H H H H H H H H H H H H H H
charge: 0
multiplicity: 1
keywords: wb97x-d3
keywords: def2-TZVPP
keywords: def2/J RIJCOSX
keywords: DEFGRID2
keywords: scfconv7
keywords: smallprint printgap noloewdin
keywords: NOSOSCF
formula: C17H17F2NO2S
InChI: InChI=1/C17H17F2NO2S/c1-11-6-7-23-16(11)15-8-17(2,22-20-15)10-21-9-12-13(18)4-3-5-14(12)19/h3-7H,8-10H2,1-2H3
40 atoms
S  3.046282 0.890432 -0.88315
F  -3.445886 -2.451394 0.549864
F  -0.180216 -0.322571 -2.0293
O  -0.5692 2.528537 1.949343
O  -1.778443 0.834402 0.144161
N  0.421532 1.591119 1.922701
C  -0.86786 2.968857 0.609625
C  0.382529 2.570023 -0.175334
C  -2.089893 2.195238 0.120922
C  0.950472 1.548793 0.764298
C  -1.147293 4.457899 0.639308
C  1.954612 0.569957 0.414656
C  2.155984 -0.678395 0.951078
C  -2.568024 -0.006825 -0.651674
C  -1.840561 -1.317122 -0.723238
C  3.2222 -1.354091 0.297523
C  1.342444 -1.284355 2.047113
C  3.792006 -0.634633 -0.706571
C  -2.264833 -2.467397 -0.076801
C  -0.611581 -1.398937 -1.36573
C  -1.524516 -3.634729 -0.053132
C  0.173402 -2.532438 -1.362641
C  -0.29694 -3.652754 -0.694623
H  1.077121 3.407177 -0.304857
H  0.167208 2.165012 -1.163384
H  -2.336062 2.535013 -0.897489
H  -2.956138 2.421712 0.759385
H  -1.364684 4.829394 -0.362678
H  -2.000564 4.690556 1.277157
H  -0.284592 5.003181 1.020397
H  -2.695359 0.410378 -1.66018
H  -3.571818 -0.137864 -0.233785
H  3.544082 -2.349946 0.569064
H  0.283329 -1.059773 1.923554
H  1.465488 -2.366739 2.060917
H  1.631914 -0.896097 3.023648
H  4.613202 -0.921475 -1.343734
H  -1.903126 -4.504072 0.465983
H  1.132299 -2.528076 -1.861467
H  0.30047 -4.553915 -0.677401
totalener: -1461.16809581 hartree
nucrepener: 2237.85234392 hartree
electener: -3699.02043973 hartree
oneelecener: -6453.55492056 hartree
twoeener: 2754.53448083 hartree
kineticenergy: 1456.19903868 hartree
xcener: -118.610955221189 hartree
chargesum: -0.0000000
charge: 0.040643 -0.202334 -0.203416 -0.223720 -0.284345 -0.079798 0.293714 -0.183484 -0.085331 0.158387 -0.280972 0.023963 -0.184109 0.046466 -0.187296 -0.149486 -0.212774 -0.161619 0.311860 0.279289 -0.189595 -0.174269 -0.094309 0.107598 0.108035 0.070531 0.090205 0.087287 0.098036 0.094338 0.089575 0.085092 0.115944 0.098629 0.076019 0.118956 0.125145 0.123967 0.124127 0.129054
qa: 0.0406 -0.2023 -0.2034 -0.2237 -0.2843 -0.0798 0.2937 -0.1835 -0.0853 0.1584 -0.2810 0.0240 -0.1841 0.0465 -0.1873 -0.1495 -0.2128 -0.1616 0.3119 0.2793 -0.1896 -0.1743 -0.0943 0.1076 0.1080 0.0705 0.0902 0.0873 0.0980 0.0943 0.0896 0.0851 0.1159 0.0986 0.0760 0.1190 0.1251 0.1240 0.1241 0.1291
va: 2.7636 1.0966 1.0926 2.0496 2.0135 2.9472 3.8927 3.9500 4.0382 3.6645 3.9385 3.6306 3.8611 3.9378 3.6927 3.9618 3.9415 4.0370 3.9112 3.8746 3.9559 3.9235 3.8685 1.0104 1.0193 0.9969 1.0047 1.0031 1.0105 1.0123 0.9942 1.0017 1.0109 1.0123 1.0014 1.0031 1.0084 1.0075 1.0102 0.9978
dispcorr: -0.024695955 hartree
energy: -1461.192791762839
dipole: 0.38084 -0.45098 -0.07014 8.27262 -8.54991 -0.27728 3.57834 -4.81834 -1.24000
magnitude: 1.27255 au
magnitude: 3.23457 debye
