program: Orca
programVersion: 5.0.2
elementType: S F F O O N C C C C C C C C C C C C C C C C C H H H H H H H H H H H H H H H H H
charge: 0
multiplicity: 1
keywords: wb97x-d3
keywords: def2-TZVPP
keywords: def2/J RIJCOSX
keywords: DEFGRID2
keywords: scfconv7
keywords: smallprint printgap noloewdin
keywords: NOSOSCF
formula: C17H17F2NO2S
InChI: InChI=1/C17H17F2NO2S/c1-11-6-7-23-16(11)15-8-17(2,22-20-15)10-21-9-12-13(18)4-3-5-14(12)19/h3-7H,8-10H2,1-2H3
40 atoms
S  3.779126 0.349461 -0.737139
F  -0.898981 -2.933581 -0.904519
F  -4.711841 -0.384855 -0.003788
O  -0.087735 2.266323 1.528795
O  -1.107428 -0.197659 0.62923
N  1.170373 1.843499 1.800768
C  -0.430271 2.027695 0.146639
C  0.861811 1.475918 -0.468393
C  -1.569441 1.022144 0.125911
C  1.733038 1.396324 0.747359
C  -0.871287 3.344314 -0.46921
C  3.086244 0.889791 0.747752
C  3.970833 0.761202 1.793258
C  -2.109639 -1.145233 0.878258
C  -2.770932 -1.637201 -0.385497
C  5.210438 0.223813 1.357497
C  3.68315 1.130767 3.211052
C  5.252375 -0.044134 0.023945
C  -2.111048 -2.499025 -1.253135
C  -4.029725 -1.221492 -0.794124
C  -2.650424 -2.935344 -2.446536
C  -4.616376 -1.623417 -1.979574
C  -3.912032 -2.484829 -2.803949
H  1.287709 2.150543 -1.21715
H  0.732417 0.500906 -0.942754
H  -1.937466 0.922387 -0.90641
H  -2.402435 1.413346 0.728314
H  -1.749255 3.74817 0.036198
H  -0.074612 4.084793 -0.399672
H  -1.117766 3.214531 -1.523781
H  -2.865453 -0.746195 1.563318
H  -1.62184 -1.974819 1.38976
H  6.041835 0.043434 2.024441
H  2.812449 0.598313 3.593342
H  4.535323 0.900025 3.848953
H  3.457858 2.192683 3.310262
H  6.072103 -0.45433 -0.54339
H  -2.092435 -3.612108 -3.078492
H  -5.601139 -1.265418 -2.245537
H  -4.352215 -2.811382 -3.736013
totalener: -1461.17295566 hartree
nucrepener: 2076.86339542 hartree
electener: -3538.03635108 hartree
oneelecener: -6131.33852275 hartree
twoeener: 2593.30217167 hartree
kineticenergy: 1456.19724303 hartree
xcener: -118.611676914337 hartree
chargesum: -0.0000000
charge: 0.032123 -0.193165 -0.201871 -0.219889 -0.286184 -0.101135 0.246579 -0.148046 -0.058467 0.266629 -0.295638 -0.081503 -0.189387 0.039839 -0.229631 -0.107907 -0.181668 -0.172837 0.274877 0.329338 -0.208424 -0.194543 -0.075483 0.103476 0.111672 0.072713 0.091587 0.098065 0.100448 0.085747 0.098191 0.097884 0.113800 0.099522 0.075138 0.097776 0.123278 0.127240 0.127076 0.132777
qa: 0.0321 -0.1932 -0.2019 -0.2199 -0.2862 -0.1011 0.2466 -0.1480 -0.0585 0.2666 -0.2956 -0.0815 -0.1894 0.0398 -0.2296 -0.1079 -0.1817 -0.1728 0.2749 0.3293 -0.2084 -0.1945 -0.0755 0.1035 0.1117 0.0727 0.0916 0.0981 0.1004 0.0857 0.0982 0.0979 0.1138 0.0995 0.0751 0.0978 0.1233 0.1272 0.1271 0.1328
va: 2.7751 1.1078 1.0889 2.0517 2.0107 2.9834 3.9470 3.9220 4.0130 3.5475 3.9741 3.6792 3.9059 3.9320 3.5765 3.9654 3.9349 4.0493 3.9399 3.8171 3.9722 3.9715 3.8740 1.0099 1.0212 0.9910 1.0053 1.0102 1.0075 1.0045 1.0046 0.9949 1.0108 1.0073 1.0026 1.0068 1.0103 1.0081 1.0083 0.9965
dispcorr: -0.018945482 hartree
energy: -1461.191901138506
dipole: 6.23060 -6.76050 -0.52990 11.45061 -11.89162 -0.44102 2.60769 -3.98055 -1.37286
magnitude: 1.53623 au
magnitude: 3.90480 debye
