program: Orca
programVersion: 5.0.2
elementType: S F F O O N C C C C C C C C C C C C C C C C C H H H H H H H H H H H H H H H H H
charge: 0
multiplicity: 1
keywords: wb97x-d3
keywords: def2-TZVPP
keywords: def2/J RIJCOSX
keywords: DEFGRID2
keywords: scfconv7
keywords: smallprint printgap noloewdin
keywords: NOSOSCF
formula: C17H17F2NO2S
InChI: InChI=1/C17H17F2NO2S/c1-11-6-7-23-16(11)15-8-17(2,22-20-15)10-21-9-12-13(18)4-3-5-14(12)19/h3-7H,8-10H2,1-2H3
40 atoms
S  3.682474 0.368985 -0.932933
F  -0.946388 -2.85183 -0.746805
F  -4.864632 -0.410986 -0.001331
O  -0.017225 2.146806 1.6946
O  -1.2475 -0.217832 0.8267
N  1.277262 1.777206 1.845173
C  -0.455955 1.96691 0.330972
C  0.763567 1.367143 -0.37978
C  -1.652942 1.03128 0.349093
C  1.753675 1.345034 0.743574
C  -0.852216 3.325683 -0.223243
C  3.117094 0.884935 0.614239
C  4.100482 0.779347 1.570456
C  -2.288515 -1.139762 1.003886
C  -2.873269 -1.607339 -0.305934
C  5.307064 0.27532 1.017819
C  3.938141 1.13956 3.010474
C  5.230369 0.011459 -0.314908
C  -2.145568 -2.432585 -1.155101
C  -4.117846 -1.210274 -0.772743
C  -2.606266 -2.8481 -2.388135
C  -4.627344 -1.595758 -1.999031
C  -3.856781 -2.417345 -2.804372
H  1.108729 1.98898 -1.210407
H  0.585445 0.363445 -0.772507
H  -2.060132 0.965949 -0.671152
H  -2.441397 1.463039 0.98327
H  -1.181198 3.241144 -1.259961
H  -1.662435 3.770995 0.354954
H  -0.005361 4.011638 -0.195767
H  -3.078228 -0.726054 1.640348
H  -1.857261 -1.98527 1.540364
H  6.201882 0.115206 1.603123
H  3.132621 0.571212 3.475345
H  4.857829 0.946868 3.561197
H  3.678519 2.190981 3.13306
H  6.003246 -0.375461 -0.959323
H  -1.996826 -3.494123 -3.004684
H  -5.604865 -1.255127 -2.310761
H  -4.235748 -2.728623 -3.768156
totalener: -1461.17303992 hartree
nucrepener: 2074.58904680 hartree
electener: -3535.76208672 hartree
oneelecener: -6126.74883847 hartree
twoeener: 2590.98675175 hartree
kineticenergy: 1456.18603965 hartree
xcener: -118.609537365188 hartree
chargesum: -0.0000000
charge: 0.031749 -0.192630 -0.202324 -0.215975 -0.284813 -0.099262 0.238016 -0.151011 -0.049869 0.261755 -0.301146 -0.082402 -0.188689 0.037273 -0.221793 -0.107685 -0.182200 -0.171659 0.264815 0.327584 -0.203957 -0.192065 -0.077137 0.100988 0.114869 0.075264 0.090588 0.084948 0.097855 0.103124 0.097851 0.101579 0.114013 0.099874 0.075309 0.097899 0.123335 0.126979 0.126504 0.132448
qa: 0.0317 -0.1926 -0.2023 -0.2160 -0.2848 -0.0993 0.2380 -0.1510 -0.0499 0.2618 -0.3011 -0.0824 -0.1887 0.0373 -0.2218 -0.1077 -0.1822 -0.1717 0.2648 0.3276 -0.2040 -0.1921 -0.0771 0.1010 0.1149 0.0753 0.0906 0.0849 0.0979 0.1031 0.0979 0.1016 0.1140 0.0999 0.0753 0.0979 0.1233 0.1270 0.1265 0.1324
va: 2.7741 1.1077 1.0880 2.0566 2.0086 2.9819 3.9503 3.9187 4.0068 3.5572 3.9827 3.6854 3.9074 3.9294 3.5737 3.9645 3.9358 4.0487 3.9481 3.8173 3.9700 3.9660 3.8743 1.0093 1.0230 0.9890 1.0055 1.0051 1.0107 1.0055 1.0060 0.9941 1.0108 1.0069 1.0026 1.0070 1.0103 1.0082 1.0083 0.9967
dispcorr: -0.018902396 hartree
energy: -1461.191942317726
dipole: 6.97388 -7.52261 -0.54873 11.50376 -11.90088 -0.39711 2.61696 -4.02885 -1.41189
magnitude: 1.56597 au
magnitude: 3.98037 debye
