program: Orca
programVersion: 5.0.2
elementType: S F F O O N C C C C C C C C C C C C C C C C C H H H H H H H H H H H H H H H H H
charge: 0
multiplicity: 1
keywords: wb97x-d3
keywords: def2-TZVPP
keywords: def2/J RIJCOSX
keywords: DEFGRID2
keywords: scfconv7
keywords: smallprint printgap noloewdin
keywords: NOSOSCF
formula: C17H17F2NO2S
InChI: InChI=1/C17H17F2NO2S/c1-11-6-7-23-16(11)15-8-17(2,22-20-15)10-21-9-12-13(18)4-3-5-14(12)19/h3-7H,8-10H2,1-2H3
40 atoms
S  2.881218 0.439612 -0.995749
F  -2.899444 -1.483618 1.218647
F  -0.905937 -0.370448 -2.86515
O  -1.263139 1.238029 1.411233
O  -2.466969 1.464058 -1.406533
N  -0.125185 0.503631 1.514838
C  -1.084122 2.320015 0.472073
C  0.196156 1.943642 -0.277434
C  -2.337244 2.417652 -0.395861
C  0.703431 0.842502 0.605865
C  -0.919275 3.604088 1.274531
C  1.974399 0.175484 0.446714
C  2.591962 -0.731384 1.274941
C  -2.997493 0.204095 -1.072808
C  -1.941027 -0.841004 -0.817682
C  3.806337 -1.202815 0.709124
C  2.070598 -1.178387 2.601072
C  4.086771 -0.664169 -0.508787
C  -1.920894 -1.631129 0.321035
C  -0.912272 -1.069105 -1.723987
C  -0.9348 -2.564482 0.578401
C  0.108442 -1.971037 -1.506047
C  0.089667 -2.717928 -0.338806
H  0.900009 2.776913 -0.337795
H  0.017174 1.593773 -1.296827
H  -2.316184 3.38635 -0.902775
H  -3.214558 2.425923 0.267582
H  -0.080669 3.52209 1.9668
H  -0.728493 4.452209 0.615753
H  -1.813439 3.823274 1.859894
H  -3.609379 -0.105241 -1.924192
H  -3.665594 0.271959 -0.210053
H  4.449674 -1.917805 1.202895
H  1.159642 -1.766423 2.490357
H  2.811117 -1.783905 3.122201
H  1.810219 -0.332188 3.236065
H  4.945259 -0.850764 -1.133804
H  -0.96719 -3.142198 1.491499
H  0.900362 -2.07908 -2.233437
H  0.884681 -3.424347 -0.144736
totalener: -1461.16835957 hartree
nucrepener: 2291.86893477 hartree
electener: -3753.03729433 hartree
oneelecener: -6561.64928022 hartree
twoeener: 2808.61198589 hartree
kineticenergy: 1456.21088989 hartree
xcener: -118.622030263489 hartree
chargesum: 0.0000000
charge: 0.032231 -0.204394 -0.194520 -0.230658 -0.313222 -0.098882 0.252578 -0.198888 -0.019583 0.254664 -0.313645 -0.067457 -0.211653 0.037267 -0.121502 -0.110818 -0.187624 -0.172399 0.333838 0.221573 -0.195752 -0.188947 -0.100891 0.117955 0.131783 0.089446 0.082659 0.105905 0.081623 0.100012 0.104659 0.097988 0.117204 0.100333 0.081520 0.097683 0.124854 0.119925 0.119386 0.125750
qa: 0.0322 -0.2044 -0.1945 -0.2307 -0.3132 -0.0989 0.2526 -0.1989 -0.0196 0.2547 -0.3136 -0.0675 -0.2117 0.0373 -0.1215 -0.1108 -0.1876 -0.1724 0.3338 0.2216 -0.1958 -0.1889 -0.1009 0.1180 0.1318 0.0894 0.0827 0.1059 0.0816 0.1000 0.1047 0.0980 0.1172 0.1003 0.0815 0.0977 0.1249 0.1199 0.1194 0.1257
va: 2.7593 1.0938 1.1042 2.0349 2.0097 2.8862 3.8026 3.9555 3.9784 3.4878 3.9826 3.5784 3.8699 3.9556 3.5710 3.9535 3.9377 4.0396 3.8370 3.9187 3.9135 3.8946 3.8245 1.0112 1.0193 0.9991 1.0099 1.0033 1.0078 1.0094 0.9897 1.0114 1.0098 1.0038 1.0024 1.0102 1.0103 1.0085 1.0166 0.9998
dispcorr: -0.026951181 hartree
energy: -1461.195310747615
dipole: 5.14801 -4.43060 0.71741 8.20583 -8.01875 0.18708 9.72060 -9.73492 -0.01432
magnitude: 0.74154 au
magnitude: 1.88484 debye
