program: Orca
programVersion: 5.0.2
elementType: S F F O O N C C C C C C C C C C C C C C C C C H H H H H H H H H H H H H H H H H
charge: 0
multiplicity: 1
keywords: wb97x-d3
keywords: def2-TZVPP
keywords: def2/J RIJCOSX
keywords: DEFGRID2
keywords: scfconv7
keywords: smallprint printgap noloewdin
keywords: NOSOSCF
formula: C17H17F2NO2S
InChI: InChI=1/C17H17F2NO2S/c1-11-6-7-23-16(11)15-8-17(2,22-20-15)10-21-9-12-13(18)4-3-5-14(12)19/h3-7H,8-10H2,1-2H3
40 atoms
S  3.938779 -0.334124 0.116795
F  -1.901325 -3.315029 0.035506
F  -4.663141 0.106112 -1.556109
O  0.332404 2.790354 1.123883
O  -1.730305 0.106046 -0.098052
N  1.603651 2.510055 1.511602
C  -0.132022 1.838589 0.141556
C  1.096444 0.97121 -0.151621
C  -1.243833 1.045469 0.820616
C  2.068143 1.524051 0.847986
C  -0.633235 2.600654 -1.071142
C  3.409753 1.024001 1.042116
C  4.397937 1.475212 1.886466
C  -2.801384 -0.655187 0.397654
C  -3.271535 -1.563584 -0.696735
C  5.57821 0.696865 1.76155
C  4.269244 2.634338 2.819067
C  5.477576 -0.307301 0.848722
C  -2.782658 -2.852475 -0.856553
C  -4.17252 -1.131699 -1.66071
C  -3.169921 -3.684419 -1.889226
C  -4.59241 -1.921441 -2.712393
C  -4.079655 -3.204701 -2.817497
H  1.465892 1.093014 -1.173699
H  0.908057 -0.095229 -0.008806
H  -2.037633 1.734241 1.146038
H  -0.849864 0.554348 1.72383
H  0.161439 3.222243 -1.484562
H  -0.966764 1.91161 -1.845693
H  -1.470816 3.249468 -0.812328
H  -3.622693 -0.005758 0.724838
H  -2.497684 -1.239906 1.273985
H  6.472785 0.885969 2.337989
H  5.20191 2.799597 3.356746
H  4.012806 3.549896 2.28646
H  3.476101 2.474721 3.549461
H  6.228468 -1.030163 0.573818
H  -2.761508 -4.6825 -1.962448
H  -5.300943 -1.535206 -3.431686
H  -4.393418 -3.839263 -3.634808
totalener: -1461.17463069 hartree
nucrepener: 2018.47843157 hartree
electener: -3479.65306226 hartree
oneelecener: -6014.30861443 hartree
twoeener: 2534.65555217 hartree
kineticenergy: 1456.18243214 hartree
xcener: -118.605800922994 hartree
chargesum: -0.0000000
charge: 0.038254 -0.201130 -0.200238 -0.220948 -0.316252 -0.105517 0.263403 -0.168535 -0.076524 0.250772 -0.295600 -0.089614 -0.186671 0.096384 -0.215304 -0.106450 -0.180539 -0.170816 0.312146 0.309536 -0.210890 -0.209496 -0.069410 0.102213 0.110960 0.096718 0.099958 0.096298 0.098733 0.090112 0.080922 0.083325 0.115155 0.076814 0.098185 0.098249 0.123890 0.124916 0.125119 0.131873
qa: 0.0383 -0.2011 -0.2002 -0.2209 -0.3163 -0.1055 0.2634 -0.1685 -0.0765 0.2508 -0.2956 -0.0896 -0.1867 0.0964 -0.2153 -0.1064 -0.1805 -0.1708 0.3121 0.3095 -0.2109 -0.2095 -0.0694 0.1022 0.1110 0.0967 0.1000 0.0963 0.0987 0.0901 0.0809 0.0833 0.1152 0.0768 0.0982 0.0982 0.1239 0.1249 0.1251 0.1319
va: 2.7775 1.0975 1.0989 2.0452 1.9747 2.9646 3.9467 3.9395 4.0447 3.5420 3.9641 3.6842 3.9019 3.8853 3.7494 3.9643 3.9367 4.0493 3.9063 3.9080 3.9757 3.9779 3.8676 1.0106 1.0207 1.0034 0.9984 1.0068 1.0130 1.0119 1.0002 1.0008 1.0107 1.0027 1.0075 1.0068 1.0103 1.0089 1.0087 0.9967
dispcorr: -0.017867026 hartree
energy: -1461.192497714457
dipole: 9.78654 -10.02667 -0.24013 11.49379 -12.51633 -1.02254 3.90354 -4.56043 -0.65689
magnitude: 1.23885 au
magnitude: 3.14891 debye
