program: Orca
programVersion: 5.0.2
elementType: S F F O O N C C C C C C C C C C C C C C C C C H H H H H H H H H H H H H H H H H
charge: 0
multiplicity: 1
keywords: wb97x-d3
keywords: def2-TZVPP
keywords: def2/J RIJCOSX
keywords: DEFGRID2
keywords: scfconv7
keywords: smallprint printgap noloewdin
keywords: NOSOSCF
formula: C17H17F2NO2S
InChI: InChI=1/C17H17F2NO2S/c1-11-6-7-23-16(11)15-8-17(2,22-20-15)10-21-9-12-13(18)4-3-5-14(12)19/h3-7H,8-10H2,1-2H3
40 atoms
S  3.00482 0.839736 -0.922314
F  -3.300864 -1.472556 1.015117
F  -0.528084 -0.482281 -2.622242
O  -1.23456 0.973379 1.447812
O  -2.349804 1.4273 -1.399934
N  -0.051068 0.306994 1.483711
C  -1.127152 2.15796 0.627618
C  0.189662 1.962833 -0.12552
C  -2.359534 2.250565 -0.27141
C  0.761291 0.804375 0.634676
C  -1.082628 3.358238 1.562916
C  2.081522 0.261414 0.415063
C  2.754053 -0.716817 1.109374
C  -2.91958 0.14765 -1.29059
C  -1.965494 -0.922901 -0.828692
C  4.023874 -0.978081 0.531015
C  2.237724 -1.421212 2.320109
C  4.292422 -0.219062 -0.566498
C  -2.19568 -1.699322 0.297148
C  -0.796574 -1.200927 -1.524906
C  -1.341113 -2.700874 0.711519
C  0.100056 -2.179247 -1.146082
C  -0.190121 -2.934781 -0.021889
H  0.832628 2.844398 -0.073682
H  0.053592 1.717179 -1.181491
H  -2.419238 3.276924 -0.645514
H  -3.254782 2.084065 0.344427
H  -2.002756 3.44286 2.14309
H  -0.253528 3.268464 2.265382
H  -0.948619 4.283991 1.001801
H  -3.278492 -0.105549 -2.290959
H  -3.797043 0.166156 -0.637644
H  4.714212 -1.709057 0.928442
H  1.945842 -0.717532 3.099227
H  1.346729 -2.004484 2.09038
H  2.994674 -2.089653 2.727912
H  5.182296 -0.226393 -1.174943
H  -1.571806 -3.274817 1.59804
H  1.002612 -2.340204 -1.718792
H  0.49422 -3.712769 0.288118
totalener: -1461.16944704 hartree
nucrepener: 2278.01340676 hartree
electener: -3739.18285379 hartree
oneelecener: -6534.01285759 hartree
twoeener: 2794.83000379 hartree
kineticenergy: 1456.21098040 hartree
xcener: -118.621243463363 hartree
chargesum: -0.0000000
charge: 0.042628 -0.207343 -0.198742 -0.229488 -0.313063 -0.085851 0.262165 -0.192036 -0.019314 0.248242 -0.313197 -0.105534 -0.204057 0.024554 -0.180202 -0.099414 -0.191200 -0.177775 0.346227 0.284059 -0.157950 -0.192151 -0.139619 0.116182 0.130968 0.092833 0.082939 0.100775 0.105312 0.080487 0.106166 0.093020 0.114909 0.098380 0.095112 0.080967 0.124702 0.117493 0.120817 0.138000
qa: 0.0426 -0.2073 -0.1987 -0.2295 -0.3131 -0.0859 0.2622 -0.1920 -0.0193 0.2482 -0.3132 -0.1055 -0.2041 0.0246 -0.1802 -0.0994 -0.1912 -0.1778 0.3462 0.2841 -0.1580 -0.1922 -0.1396 0.1162 0.1310 0.0928 0.0829 0.1008 0.1053 0.0805 0.1062 0.0930 0.1149 0.0984 0.0951 0.0810 0.1247 0.1175 0.1208 0.1380
va: 2.7784 1.0883 1.1000 2.0204 2.0074 2.8970 3.8038 3.9407 3.9782 3.4750 3.9859 3.6380 3.8542 3.9467 3.5873 3.9533 3.9369 4.0503 3.8549 3.8664 3.9232 3.9129 3.8696 1.0121 1.0266 0.9982 1.0112 1.0087 1.0038 1.0078 0.9915 1.0121 1.0104 1.0090 1.0080 1.0030 1.0103 1.0095 1.0103 0.9920
dispcorr: -0.026231732 hartree
energy: -1461.195678768607
dipole: 4.54411 -3.96750 0.57661 6.88311 -6.70724 0.17587 9.76694 -9.74185 0.02509
magnitude: 0.60336 au
magnitude: 1.53361 debye
