program: Orca
programVersion: 5.0.2
elementType: O O C C C C C C C C C C C C C C C C C C H H H H H H H H H H H H H H H H H H H H H H H H H H
charge: 0
multiplicity: 1
keywords: wb97x-d3
keywords: def2-TZVPP
keywords: def2/J RIJCOSX
keywords: DEFGRID2
keywords: scfconv7
keywords: smallprint printgap noloewdin
keywords: NOSOSCF
formula: C18H26O2
InChI: InChI=1/C18H26O2/c1-13(2)18-10-9-17(4,20-18)16(11-18)19-12-15-8-6-5-7-14(15)3/h5-8,13,16H,9-12H2,1-4H3
46 atoms
O  2.204704 0.144435 -0.871891
O  -0.060328 -1.700837 -0.607337
C  1.79059 1.019106 0.18238
C  2.219514 -1.080065 -0.137666
C  0.776636 -1.155797 0.391338
C  0.501097 0.335034 0.682735
C  2.864947 0.763905 1.254632
C  3.124315 -0.740708 1.062921
C  1.649658 2.457135 -0.309976
C  2.694667 -2.233308 -0.98254
C  2.935604 2.986037 -0.944617
C  0.491796 2.652004 -1.28876
C  -1.288617 -2.218679 -0.136903
C  -2.273998 -1.168626 0.306551
C  -2.827187 -0.259148 -0.607932
C  -2.619624 -1.085126 1.650645
C  -3.709427 0.707462 -0.134155
C  -2.466811 -0.285106 -2.064119
C  -3.502505 -0.116896 2.110725
C  -4.04614 0.785963 1.211291
H  0.722254 -1.776432 1.293646
H  -0.371434 0.669858 0.126701
H  0.309176 0.534478 1.737119
H  2.507709 1.019606 2.251911
H  3.769187 1.344479 1.072848
H  4.167959 -0.937747 0.813427
H  2.882935 -1.340647 1.940912
H  1.441529 3.058504 0.582073
H  3.728898 -2.080443 -1.293532
H  2.659564 -3.157368 -0.404672
H  2.089873 -2.374816 -1.877235
H  2.818555 4.039578 -1.201909
H  3.797305 2.913502 -0.281674
H  3.17732 2.454422 -1.866447
H  -0.48235 2.45606 -0.841031
H  0.594454 2.009592 -2.16557
H  0.473665 3.683442 -1.643905
H  -1.112067 -2.918343 0.689718
H  -1.702539 -2.801349 -0.963678
H  -2.185234 -1.789953 2.35033
H  -4.143109 1.412886 -0.833345
H  -2.511345 -1.292131 -2.482188
H  -3.143396 0.342909 -2.642286
H  -1.453548 0.084946 -2.233991
H  -3.758163 -0.067606 3.161128
H  -4.733556 1.550053 1.550911
elementType: O C H
totalener: -852.10834424 hartree
nucrepener: 1702.84899182 hartree
electener: -2554.95733607 hartree
oneelecener: -4540.69937872 hartree
twoeener: 1985.74204265 hartree
cpcmener: -0.02458501 hartree
kineticenergy: 848.06702404 hartree
xcener: -85.355422836285 hartree
chargesum: 0.0000000
charge: -0.453759 -0.395978 0.318640 0.317121 0.064834 -0.220626 -0.241920 -0.187756 0.085876 -0.305072 -0.308621 -0.324574 0.031165 -0.035943 -0.052621 -0.125390 -0.162672 -0.243253 -0.194015 -0.146425 0.081114 0.052601 0.100186 0.085445 0.097025 0.087448 0.085828 0.040392 0.096603 0.099144 0.085969 0.095060 0.092790 0.082470 0.089390 0.088648 0.099863 0.104686 0.122819 0.138865 0.139646 0.108616 0.096639 0.090972 0.158710 0.160061
qa: -0.4538 -0.3960 0.3186 0.3171 0.0648 -0.2206 -0.2419 -0.1878 0.0859 -0.3051 -0.3086 -0.3246 0.0312 -0.0359 -0.0526 -0.1254 -0.1627 -0.2433 -0.1940 -0.1464 0.0811 0.0526 0.1002 0.0854 0.0970 0.0874 0.0858 0.0404 0.0966 0.0991 0.0860 0.0951 0.0928 0.0825 0.0894 0.0886 0.0999 0.1047 0.1228 0.1389 0.1396 0.1086 0.0966 0.0910 0.1587 0.1601
va: 2.0079 1.9077 3.7840 3.7696 3.9927 3.9871 4.0164 3.9300 3.6555 3.9178 3.9442 3.9496 3.8645 3.4881 3.6998 3.8391 3.8759 3.9211 3.9179 3.8828 1.0143 1.0458 1.0188 1.0169 1.0121 1.0125 1.0153 1.0183 1.0073 1.0007 1.0200 1.0035 1.0067 1.0096 0.9987 1.0092 1.0069 1.0013 0.9907 1.0020 1.0004 0.9994 1.0045 1.0056 0.9909 0.9881
dispcorr: -0.025476018 hartree
energy: -852.133820262175
dipole: 9.01546 -9.29270 -0.27724 6.70699 -6.77222 -0.06523 -2.99888 4.43174 1.43286
magnitude: 1.46089 au
magnitude: 3.71329 debye
