program: Orca
programVersion: 5.0.2
elementType: O O C C C C C C C C C C C C C C C C C C H H H H H H H H H H H H H H H H H H H H H H H H H H
charge: 0
multiplicity: 1
keywords: wb97x-d3
keywords: def2-TZVPP
keywords: def2/J RIJCOSX
keywords: DEFGRID2
keywords: scfconv7
keywords: smallprint printgap noloewdin
keywords: NOSOSCF
formula: C18H26O2
InChI: InChI=1/C18H26O2/c1-13(2)18-10-9-17(4,20-18)16(11-18)19-12-15-8-6-5-7-14(15)3/h5-8,13,16H,9-12H2,1-4H3
46 atoms
O  2.078801 -0.029233 -0.882195
O  -0.752747 0.92103 -0.612085
C  2.584896 0.937212 0.045325
C  1.079306 -0.617722 -0.046637
C  0.228487 0.605087 0.357326
C  1.308088 1.703333 0.434029
C  2.982033 0.053712 1.240916
C  1.890465 -1.028068 1.196396
C  3.722299 1.745086 -0.561922
C  0.369364 -1.752943 -0.735039
C  3.34271 2.456727 -1.856371
C  4.268125 2.743907 0.45423
C  -2.070749 1.068517 -0.108608
C  -2.706178 -0.245407 0.261667
C  -3.178376 -1.123567 -0.725306
C  -2.774722 -0.619826 1.599731
C  -3.691304 -2.356099 -0.331796
C  -3.152399 -0.756693 -2.180573
C  -3.288468 -1.852518 1.980213
C  -3.743956 -2.726297 1.00609
H  -0.242075 0.430751 1.32863
H  1.083085 2.493786 -0.284051
H  1.377276 2.163277 1.419607
H  3.000676 0.608012 2.178701
H  3.97637 -0.372122 1.089428
H  2.316682 -2.022613 1.056118
H  1.274271 -1.063889 2.095497
H  4.523476 1.032736 -0.791939
H  -0.38338 -2.177367 -0.069638
H  -0.129339 -1.443324 -1.652962
H  1.072897 -2.549009 -0.983377
H  2.572648 3.213486 -1.695851
H  4.213622 2.969011 -2.268765
H  2.981326 1.767901 -2.620067
H  5.127518 3.275166 0.042821
H  4.596461 2.258867 1.374212
H  3.519419 3.492953 0.720516
H  -2.640206 1.566031 -0.896047
H  -2.077993 1.737859 0.759505
H  -2.419167 0.067995 2.358424
H  -4.057701 -3.040312 -1.088014
H  -3.439428 -1.604761 -2.800546
H  -3.847531 0.056866 -2.398459
H  -2.166655 -0.427325 -2.507964
H  -3.329859 -2.125268 3.026622
H  -4.146035 -3.692492 1.282671
elementType: O C H
totalener: -852.11002104 hartree
nucrepener: 1675.24484809 hartree
electener: -2527.35486913 hartree
oneelecener: -4485.33163598 hartree
twoeener: 1957.97676685 hartree
cpcmener: -0.02496606 hartree
kineticenergy: 848.06659162 hartree
xcener: -85.353605452557 hartree
chargesum: 0.0000000
charge: -0.444383 -0.412458 0.336843 0.407601 0.080004 -0.293149 -0.210626 -0.228579 0.020765 -0.351634 -0.300177 -0.318059 0.048403 0.006561 -0.101374 -0.151936 -0.134069 -0.248040 -0.188631 -0.160622 0.087540 0.088631 0.099824 0.085722 0.090916 0.086163 0.087187 0.036152 0.089640 0.102358 0.105371 0.081584 0.096988 0.091208 0.097617 0.097551 0.087855 0.116124 0.107479 0.146196 0.140385 0.094715 0.112145 0.095339 0.158922 0.159948
qa: -0.4444 -0.4125 0.3368 0.4076 0.0800 -0.2931 -0.2106 -0.2286 0.0208 -0.3516 -0.3002 -0.3181 0.0484 0.0066 -0.1014 -0.1519 -0.1341 -0.2480 -0.1886 -0.1606 0.0875 0.0886 0.0998 0.0857 0.0909 0.0862 0.0872 0.0362 0.0896 0.1024 0.1054 0.0816 0.0970 0.0912 0.0976 0.0976 0.0879 0.1161 0.1075 0.1462 0.1404 0.0947 0.1121 0.0953 0.1589 0.1599
va: 2.0111 1.9016 3.7326 3.5767 3.9850 4.1192 3.9772 3.9811 3.7418 3.9441 3.9380 3.9517 3.8701 3.4337 3.7622 3.8566 3.8667 3.9134 3.9186 3.9037 1.0033 1.0365 1.0122 1.0129 1.0144 1.0131 1.0095 1.0242 0.9972 1.0053 1.0120 1.0016 1.0029 1.0167 1.0037 1.0008 0.9986 0.9905 0.9953 0.9988 0.9993 1.0047 0.9938 1.0070 0.9911 0.9887
dispcorr: -0.024863150 hartree
energy: -852.134884194085
dipole: 11.98036 -12.31105 -0.33069 6.24432 -6.09179 0.15253 -1.18821 2.61253 1.42432
magnitude: 1.47014 au
magnitude: 3.73681 debye
