program: Orca
programVersion: 5.0.2
elementType: O O C C C C C C C C C C C C C C C C C C H H H H H H H H H H H H H H H H H H H H H H H H H H
charge: 0
multiplicity: 1
keywords: wb97x-d3
keywords: def2-TZVPP
keywords: def2/J RIJCOSX
keywords: DEFGRID2
keywords: scfconv7
keywords: smallprint printgap noloewdin
keywords: NOSOSCF
formula: C18H26O2
InChI: InChI=1/C18H26O2/c1-13(2)18-10-9-17(4,20-18)16(11-18)19-12-15-8-6-5-7-14(15)3/h5-8,13,16H,9-12H2,1-4H3
46 atoms
O  2.65029 -0.321352 -0.199754
O  -0.174492 -1.074527 -0.811668
C  2.409905 1.08797 -0.274461
C  1.634788 -0.656416 0.746861
C  0.362023 -0.110655 0.073828
C  0.917765 1.129499 -0.655315
C  2.524013 1.521131 1.198544
C  1.957966 0.284959 1.920414
C  3.345689 1.753057 -1.2726
C  1.646164 -2.123367 1.089061
C  3.04264 3.244596 -1.376413
C  4.821015 1.529838 -0.956269
C  -1.45524 -0.738138 -1.29004
C  -2.557465 -0.937696 -0.27438
C  -3.78441 -0.278571 -0.434867
C  -2.379718 -1.795729 0.806564
C  -4.789005 -0.489803 0.506305
C  -4.030477 0.638725 -1.597219
C  -3.388911 -1.992806 1.739027
C  -4.599088 -1.333785 1.591261
H  -0.384607 0.155221 0.829461
H  0.798434 1.025876 -1.737466
H  0.430531 2.056527 -0.355649
H  1.961106 2.431919 1.401052
H  3.559744 1.706273 1.485453
H  2.703721 -0.173453 2.571778
H  1.080431 0.498608 2.531059
H  3.137404 1.302172 -2.250172
H  2.587407 -2.397263 1.567617
H  0.843322 -2.347832 1.792114
H  1.513024 -2.758576 0.214213
H  3.684087 3.712666 -2.124519
H  2.00974 3.43605 -1.670067
H  3.22079 3.757176 -0.428802
H  5.111917 2.004234 -0.017548
H  5.441055 1.966083 -1.741047
H  5.078712 0.472698 -0.890789
H  -1.640498 -1.375793 -2.159825
H  -1.470569 0.293648 -1.662439
H  -1.439729 -2.317509 0.934102
H  -5.73695 0.021413 0.386051
H  -5.048404 1.025417 -1.578957
H  -3.354006 1.496364 -1.588921
H  -3.887264 0.133101 -2.554042
H  -3.226064 -2.659304 2.576136
H  -5.393058 -1.475447 2.313096
elementType: O C H
totalener: -852.11162636 hartree
nucrepener: 1647.33852844 hartree
electener: -2499.45015480 hartree
oneelecener: -4429.09169692 hartree
twoeener: 1929.64154212 hartree
cpcmener: -0.02490807 hartree
kineticenergy: 848.05855339 hartree
xcener: -85.354316614364 hartree
chargesum: -0.0000000
charge: -0.440314 -0.398887 0.358587 0.385247 0.068340 -0.311925 -0.249533 -0.215484 0.027802 -0.326094 -0.319321 -0.301174 0.037304 0.021619 -0.078672 -0.211666 -0.140547 -0.243684 -0.179561 -0.173703 0.091553 0.092227 0.103774 0.089169 0.103036 0.088048 0.086861 0.037258 0.102363 0.095929 0.093562 0.097258 0.097262 0.088312 0.080800 0.097159 0.091114 0.121381 0.104103 0.166970 0.139389 0.093080 0.104997 0.110331 0.156898 0.158832
qa: -0.4403 -0.3989 0.3586 0.3852 0.0683 -0.3119 -0.2495 -0.2155 0.0278 -0.3261 -0.3193 -0.3012 0.0373 0.0216 -0.0787 -0.2117 -0.1405 -0.2437 -0.1796 -0.1737 0.0916 0.0922 0.1038 0.0892 0.1030 0.0880 0.0869 0.0373 0.1024 0.0959 0.0936 0.0973 0.0973 0.0883 0.0808 0.0972 0.0911 0.1214 0.1041 0.1670 0.1394 0.0931 0.1050 0.1103 0.1569 0.1588
va: 2.0177 1.9223 3.7083 3.6705 3.9378 4.0702 4.0143 3.9740 3.7344 3.8989 3.9530 3.9349 3.8846 3.4829 3.8000 3.9179 3.8656 3.9119 3.9226 3.9015 1.0016 1.0264 1.0075 1.0118 1.0064 1.0133 1.0117 1.0238 1.0086 1.0008 1.0177 1.0038 1.0021 0.9978 1.0033 1.0029 1.0172 0.9894 0.9852 0.9928 1.0008 1.0062 0.9938 0.9922 0.9929 0.9896
dispcorr: -0.023177823 hartree
energy: -852.134804186308
dipole: 10.95725 -11.81839 -0.86114 11.35692 -9.97422 1.38271 -2.05241 2.39344 0.34102
magnitude: 1.66425 au
magnitude: 4.23019 debye
