program: Orca
programVersion: 5.0.2
elementType: O O C C C C C C C C C C C C C C C C C C H H H H H H H H H H H H H H H H H H H H H H H H H H
charge: 0
multiplicity: 1
keywords: wb97x-d3
keywords: def2-TZVPP
keywords: def2/J RIJCOSX
keywords: DEFGRID2
keywords: scfconv7
keywords: smallprint printgap noloewdin
keywords: NOSOSCF
formula: C18H26O2
InChI: InChI=1/C18H26O2/c1-13(2)18-10-9-17(4,20-18)16(11-18)19-12-15-8-6-5-7-14(15)3/h5-8,13,16H,9-12H2,1-4H3
46 atoms
O  2.07392 0.110308 -1.024573
O  0.049258 -1.793494 -0.108934
C  2.027962 0.941453 0.140002
C  2.340451 -1.136509 -0.380992
C  1.151985 -1.249735 0.588801
C  0.976841 0.224475 1.01124
C  3.404729 0.673991 0.77043
C  3.591289 -0.820799 0.460591
C  1.755328 2.393479 -0.223632
C  2.518021 -2.253353 -1.376792
C  0.4861 2.591995 -1.045649
C  1.709877 3.255093 1.034397
C  -1.168702 -1.812067 0.596818
C  -2.184253 -0.841813 0.044528
C  -3.38216 -0.633993 0.743857
C  -1.965069 -0.170626 -1.152786
C  -4.316058 0.258971 0.227581
C  -3.65443 -1.353642 2.031609
C  -2.908856 0.714942 -1.657673
C  -4.087282 0.935475 -0.963524
H  1.39336 -1.894295 1.441995
H  -0.031903 0.583784 0.801977
H  1.155976 0.372139 2.075813
H  3.426705 0.898178 1.836181
H  4.171865 1.283759 0.288103
H  4.494605 -1.001294 -0.123785
H  3.652592 -1.445334 1.352449
H  2.604825 2.731024 -0.829136
H  3.387924 -2.065552 -2.007417
H  2.690085 -3.19483 -0.85423
H  1.651408 -2.381121 -2.02402
H  0.487322 2.009487 -1.966942
H  -0.409715 2.327384 -0.481358
H  0.38778 3.641422 -1.328543
H  0.873702 2.975741 1.678918
H  1.580802 4.305948 0.771489
H  2.625193 3.177189 1.622263
H  -1.009606 -1.617305 1.664139
H  -1.578083 -2.827988 0.538909
H  -1.041703 -0.321295 -1.695919
H  -5.238265 0.428154 0.771055
H  -2.929053 -1.089376 2.80463
H  -4.644674 -1.111107 2.414277
H  -3.60309 -2.437764 1.910109
H  -2.715412 1.233337 -2.588101
H  -4.827505 1.627467 -1.344036
elementType: O C H
totalener: -852.10987278 hartree
nucrepener: 1690.99141074 hartree
electener: -2543.10128352 hartree
oneelecener: -4516.87024071 hartree
twoeener: 1973.76895719 hartree
cpcmener: -0.02455620 hartree
kineticenergy: 848.06274256 hartree
xcener: -85.357181984918 hartree
chargesum: -0.0000000
charge: -0.444360 -0.406329 0.364163 0.313387 0.094361 -0.341670 -0.227997 -0.185956 0.052970 -0.305447 -0.327522 -0.320535 0.023268 0.071806 -0.098277 -0.222071 -0.129641 -0.244852 -0.172559 -0.174241 0.097253 0.121812 0.104352 0.085939 0.090352 0.087055 0.087527 0.037065 0.095987 0.100679 0.091342 0.094922 0.077666 0.105921 0.089241 0.097640 0.097836 0.109527 0.116400 0.130492 0.140295 0.106973 0.092966 0.106495 0.157212 0.158555
qa: -0.4444 -0.4063 0.3642 0.3134 0.0944 -0.3417 -0.2280 -0.1860 0.0530 -0.3054 -0.3275 -0.3205 0.0233 0.0718 -0.0983 -0.2221 -0.1296 -0.2449 -0.1726 -0.1742 0.0973 0.1218 0.1044 0.0859 0.0904 0.0871 0.0875 0.0371 0.0960 0.1007 0.0913 0.0949 0.0777 0.1059 0.0892 0.0976 0.0978 0.1095 0.1164 0.1305 0.1403 0.1070 0.0930 0.1065 0.1572 0.1586
va: 1.9983 1.9364 3.6802 3.7378 3.8976 3.9914 3.9921 3.9544 3.7208 3.9189 3.9552 3.9533 3.9311 3.3951 3.8152 3.8731 3.8544 3.9108 3.8863 3.9022 1.0134 0.9989 1.0179 1.0123 1.0147 1.0140 1.0167 1.0240 1.0075 1.0006 1.0125 1.0108 0.9955 1.0062 0.9978 1.0039 1.0014 0.9877 0.9927 1.0364 0.9997 0.9946 1.0060 0.9942 0.9922 0.9890
dispcorr: -0.025044500 hartree
energy: -852.134917284370
dipole: 6.52973 -6.28958 0.24015 5.80307 -5.86495 -0.06187 6.39906 -4.50824 1.89081
magnitude: 1.90701 au
magnitude: 4.84723 debye
