program: Orca
programVersion: 5.0.2
elementType: O O C C C C C C C C C C C C C C C C C C H H H H H H H H H H H H H H H H H H H H H H H H H H
charge: 0
multiplicity: 1
keywords: wb97x-d3
keywords: def2-TZVPP
keywords: def2/J RIJCOSX
keywords: DEFGRID2
keywords: scfconv7
keywords: smallprint printgap noloewdin
keywords: NOSOSCF
formula: C18H26O2
InChI: InChI=1/C18H26O2/c1-13(2)18-10-9-17(4,20-18)16(11-18)19-12-15-8-6-5-7-14(15)3/h5-8,13,16H,9-12H2,1-4H3
46 atoms
O  2.093933 0.138372 -1.019479
O  0.048097 -1.784192 -0.156954
C  2.037167 0.94465 0.161957
C  2.34358 -1.12395 -0.39954
C  1.144874 -1.249711 0.556721
C  0.965663 0.218451 0.998961
C  3.401362 0.652063 0.809193
C  3.587568 -0.83418 0.460452
C  1.784061 2.406679 -0.174982
C  2.523403 -2.22076 -1.41705
C  0.523261 2.638322 -1.001311
C  1.741436 3.244477 1.099216
C  -1.170318 -1.830844 0.546454
C  -2.192262 -0.852237 0.022156
C  -3.403371 -0.695298 0.711741
C  -1.965353 -0.122366 -1.138792
C  -4.343128 0.206962 0.223109
C  -3.683218 -1.479446 1.959601
C  -2.913538 0.774354 -1.61479
C  -4.106423 0.942934 -0.930783
H  1.378943 -1.906106 1.402902
H  -0.036463 0.584256 0.77039
H  1.120347 0.349595 2.06947
H  3.40365 0.845185 1.881209
H  4.180422 1.271735 0.35977
H  4.494619 -0.99985 -0.122589
H  3.642066 -1.483042 1.335201
H  2.642115 2.745001 -0.767926
H  2.680921 -3.174804 -0.913073
H  1.663699 -2.326408 -2.077342
H  3.402462 -2.027024 -2.033055
H  0.447675 3.692156 -1.274542
H  0.517167 2.06456 -1.928076
H  -0.380402 2.386941 -0.443391
H  0.899729 2.961616 1.734975
H  1.623963 4.301391 0.855872
H  2.653361 3.146566 1.689292
H  -1.013556 -1.665151 1.619169
H  -1.57228 -2.847653 0.459285
H  -1.032623 -0.23638 -1.674847
H  -5.276932 0.33484 0.758046
H  -2.972853 -1.242222 2.7550
H  -4.682304 -1.269843 2.338769
H  -3.613803 -2.555676 1.787256
H  -2.714394 1.338325 -2.517036
H  -4.851256 1.641506 -1.289664
elementType: O C H
totalener: -852.10994341 hartree
nucrepener: 1689.09341631 hartree
electener: -2541.20335972 hartree
oneelecener: -4513.05090723 hartree
twoeener: 1971.84754752 hartree
cpcmener: -0.02448907 hartree
kineticenergy: 848.06258437 hartree
xcener: -85.357050337567 hartree
chargesum: -0.0000000
charge: -0.444982 -0.406472 0.368964 0.312529 0.099000 -0.347714 -0.225888 -0.187996 0.051274 -0.306076 -0.327744 -0.320446 0.023456 0.078127 -0.104800 -0.225547 -0.127463 -0.244452 -0.171629 -0.175548 0.097609 0.121794 0.104176 0.085812 0.090840 0.086801 0.087216 0.037292 0.100689 0.091258 0.096027 0.105930 0.095572 0.077744 0.089306 0.097682 0.097511 0.109456 0.116751 0.131743 0.140403 0.106987 0.093034 0.106104 0.157236 0.158436
qa: -0.4450 -0.4065 0.3690 0.3125 0.0990 -0.3477 -0.2259 -0.1880 0.0513 -0.3061 -0.3277 -0.3204 0.0235 0.0781 -0.1048 -0.2255 -0.1275 -0.2445 -0.1716 -0.1755 0.0976 0.1218 0.1042 0.0858 0.0908 0.0868 0.0872 0.0373 0.1007 0.0913 0.0960 0.1059 0.0956 0.0777 0.0893 0.0977 0.0975 0.1095 0.1168 0.1317 0.1404 0.1070 0.0930 0.1061 0.1572 0.1584
va: 1.9986 1.9355 3.6762 3.7415 3.8904 3.9984 3.9904 3.9577 3.7219 3.9184 3.9540 3.9533 3.9344 3.3944 3.8227 3.8754 3.8523 3.9109 3.8870 3.9045 1.0133 0.9979 1.0182 1.0120 1.0143 1.0141 1.0169 1.0241 1.0006 1.0128 1.0075 1.0063 1.0108 0.9958 0.9979 1.0038 1.0014 0.9878 0.9931 1.0363 0.9996 0.9947 1.0059 0.9945 0.9922 0.9891
dispcorr: -0.024956558 hartree
energy: -852.134899968301
dipole: 6.56731 -6.34475 0.22257 5.61829 -5.73472 -0.11643 6.47365 -4.58634 1.88731
magnitude: 1.90395 au
magnitude: 4.83946 debye
