program: Orca
programVersion: 5.0.2
elementType: O O C C C C C C C C C C C C C C C C C C H H H H H H H H H H H H H H H H H H H H H H H H H H
charge: 0
multiplicity: 1
keywords: wb97x-d3
keywords: def2-TZVPP
keywords: def2/J RIJCOSX
keywords: DEFGRID2
keywords: scfconv7
keywords: smallprint printgap noloewdin
keywords: NOSOSCF
formula: C18H26O2
InChI: InChI=1/C18H26O2/c1-13(2)18-10-9-17(4,20-18)16(11-18)19-12-15-8-6-5-7-14(15)3/h5-8,13,16H,9-12H2,1-4H3
46 atoms
O  2.078214 0.802966 -0.993702
O  -0.42872 -0.425594 0.081348
C  2.701891 0.919021 0.289233
C  1.754578 -0.587644 -0.946454
C  0.929048 -0.696925 0.348325
C  1.600214 0.380719 1.224503
C  3.794529 -0.167532 0.227268
C  3.119447 -1.233094 -0.653207
C  3.194828 2.339573 0.552485
C  1.08878 -1.052905 -2.215246
C  4.132333 2.848476 -0.542764
C  2.065211 3.347745 0.754395
C  -1.284055 -0.73213 1.165552
C  -2.707148 -0.645783 0.69657
C  -3.245035 -1.620818 -0.157551
C  -3.498237 0.423379 1.102505
C  -4.564459 -1.480219 -0.579051
C  -2.4422 -2.806562 -0.606255
C  -4.814913 0.548154 0.679539
C  -5.347286 -0.408452 -0.16999
H  1.018336 -1.701519 0.78021
H  0.872689 1.154387 1.4739
H  2.00254 -0.007164 2.159974
H  4.053392 -0.528937 1.222268
H  4.711168 0.200871 -0.232343
H  3.667441 -1.387599 -1.58417
H  3.021558 -2.204895 -0.169132
H  3.767022 2.283832 1.485424
H  1.76927 -0.957044 -3.062504
H  0.819405 -2.106324 -2.130433
H  0.182841 -0.492462 -2.443741
H  3.60395 3.003432 -1.484944
H  4.556903 3.809668 -0.250462
H  4.968161 2.176554 -0.735454
H  1.475528 3.146831 1.648347
H  1.384478 3.365751 -0.098766
H  2.475679 4.35256 0.865201
H  -1.125948 -0.037937 2.000143
H  -1.064047 -1.738626 1.54643
H  -3.075474 1.170158 1.764515
H  -4.98912 -2.228917 -1.237271
H  -2.038713 -3.364606 0.241258
H  -3.055514 -3.492821 -1.188687
H  -1.593346 -2.516359 -1.226772
H  -5.415122 1.385883 1.00974
H  -6.37077 -0.327307 -0.512837
elementType: O C H
totalener: -852.11054403 hartree
nucrepener: 1638.55240095 hartree
electener: -2490.66294498 hartree
oneelecener: -4412.08569090 hartree
twoeener: 1921.42274592 hartree
cpcmener: -0.02746904 hartree
kineticenergy: 848.05823074 hartree
xcener: -85.350268674143 hartree
chargesum: -0.0000000
charge: -0.450476 -0.382439 0.315639 0.348240 0.068163 -0.275313 -0.226541 -0.204152 0.068795 -0.334031 -0.307437 -0.316162 0.024403 -0.051699 -0.059845 -0.122383 -0.149091 -0.224114 -0.193409 -0.154991 0.077184 0.104255 0.096057 0.086079 0.098176 0.085466 0.085474 0.042388 0.103396 0.099299 0.092246 0.081253 0.095473 0.093884 0.089550 0.089298 0.095298 0.094474 0.115801 0.142723 0.141544 0.101184 0.097579 0.099933 0.158867 0.159961
qa: -0.4505 -0.3824 0.3156 0.3482 0.0682 -0.2753 -0.2265 -0.2042 0.0688 -0.3340 -0.3074 -0.3162 0.0244 -0.0517 -0.0598 -0.1224 -0.1491 -0.2241 -0.1934 -0.1550 0.0772 0.1043 0.0961 0.0861 0.0982 0.0855 0.0855 0.0424 0.1034 0.0993 0.0922 0.0813 0.0955 0.0939 0.0896 0.0893 0.0953 0.0945 0.1158 0.1427 0.1415 0.1012 0.0976 0.0999 0.1589 0.1600
va: 2.0120 1.9234 3.7373 3.7112 4.0205 3.9815 4.0037 3.9525 3.6720 3.9104 3.9487 3.9439 3.8726 3.6512 3.7464 3.8768 3.8719 3.8988 3.9158 3.8931 1.0165 1.0180 1.0175 1.0167 1.0108 1.0139 1.0141 1.0175 1.0094 0.9992 1.0153 1.0086 1.0031 1.0068 1.0031 1.0115 1.0038 0.9947 0.9873 1.0015 1.0006 0.9999 1.0066 0.9976 0.9914 0.9893
dispcorr: -0.022773668 hartree
energy: -852.133317693960
dipole: 14.69609 -14.06174 0.63434 2.64560 -3.71551 -1.06991 -0.10077 1.38530 1.28453
magnitude: 1.78804 au
magnitude: 4.54485 debye
