program: Orca
programVersion: 5.0.2
elementType: O O C C C C C C C C C C C C C C C C C C H H H H H H H H H H H H H H H H H H H H H H H H H H
charge: 0
multiplicity: 1
keywords: wb97x-d3
keywords: def2-TZVPP
keywords: def2/J RIJCOSX
keywords: DEFGRID2
keywords: scfconv7
keywords: smallprint printgap noloewdin
keywords: NOSOSCF
formula: C18H26O2
InChI: InChI=1/C18H26O2/c1-13(2)18-10-9-17(4,20-18)16(11-18)19-12-15-8-6-5-7-14(15)3/h5-8,13,16H,9-12H2,1-4H3
46 atoms
O  1.652957 1.164391 -0.634465
O  -0.346198 -0.509756 0.732284
C  2.624331 1.009557 0.403103
C  1.442763 -0.215673 -0.935663
C  1.011523 -0.772073 0.439583
C  1.898236 0.062775 1.377742
C  3.719794 0.193461 -0.301524
C  2.872448 -0.724612 -1.200974
C  3.024273 2.352198 0.995246
C  0.488215 -0.381928 -2.089277
C  4.108738 2.157485 2.050573
C  3.47013 3.367058 -0.052301
C  -1.242555 -1.536792 0.384698
C  -2.612483 -0.983875 0.103703
C  -3.642372 -1.877763 -0.226196
C  -2.874917 0.381282 0.137689
C  -4.904242 -1.37233 -0.520406
C  -3.38759 -3.354878 -0.272679
C  -4.142972 0.869804 -0.153826
C  -5.160995 -0.007726 -0.487681
H  1.213743 -1.845682 0.517177
H  1.278562 0.626211 2.079451
H  2.583908 -0.550097 1.961483
H  4.344829 -0.352734 0.404249
H  4.375917 0.833529 -0.893323
H  3.129051 -0.603729 -2.254439
H  2.97951 -1.783291 -0.961303
H  2.137782 2.75671 1.497691
H  0.364698 -1.437545 -2.331273
H  -0.49689 0.036592 -1.880822
H  0.880965 0.11192 -2.97939
H  3.809012 1.447782 2.822984
H  5.037784 1.795074 1.605998
H  4.332735 3.102579 2.547064
H  2.687519 3.586653 -0.778306
H  4.351052 3.0283 -0.600658
H  3.734854 4.309181 0.430372
H  -1.297237 -2.276677 1.196304
H  -0.898775 -2.087763 -0.498792
H  -2.089472 1.080349 0.389018
H  -5.698775 -2.060829 -0.782541
H  -3.046487 -3.737423 0.691836
H  -4.289812 -3.901061 -0.543525
H  -2.61544 -3.610095 -1.0021
H  -4.326932 1.936041 -0.124499
H  -6.149812 0.363307 -0.724113
elementType: O C H
totalener: -852.11115105 hartree
nucrepener: 1635.85357154 hartree
electener: -2487.96472259 hartree
oneelecener: -4406.45631161 hartree
twoeener: 1918.49158902 hartree
cpcmener: -0.02622248 hartree
kineticenergy: 848.06731091 hartree
xcener: -85.355257833835 hartree
chargesum: 0.0000000
charge: -0.444028 -0.408334 0.329501 0.336895 0.120116 -0.239237 -0.249369 -0.202586 0.021305 -0.333653 -0.317478 -0.300845 0.007535 0.088790 -0.117271 -0.223589 -0.121953 -0.240583 -0.169763 -0.185235 0.085450 0.082962 0.098298 0.087876 0.099034 0.082187 0.090233 0.037702 0.105041 0.097454 0.100392 0.098445 0.086387 0.097723 0.090022 0.083228 0.095723 0.123256 0.109046 0.138498 0.141339 0.105096 0.092882 0.104034 0.158796 0.158675
qa: -0.4440 -0.4083 0.3295 0.3369 0.1201 -0.2392 -0.2494 -0.2026 0.0213 -0.3337 -0.3175 -0.3008 0.0075 0.0888 -0.1173 -0.2236 -0.1220 -0.2406 -0.1698 -0.1852 0.0855 0.0830 0.0983 0.0879 0.0990 0.0822 0.0902 0.0377 0.1050 0.0975 0.1004 0.0984 0.0864 0.0977 0.0900 0.0832 0.0957 0.1233 0.1090 0.1385 0.1413 0.1051 0.0929 0.1040 0.1588 0.1587
va: 1.9885 1.9245 3.7199 3.7134 3.8794 4.0341 4.0296 3.9739 3.7454 3.8961 3.9511 3.9382 3.9239 3.4458 3.8582 3.9161 3.8397 3.9245 3.9158 3.9121 1.0089 1.0387 1.0111 1.0136 1.0065 1.0167 1.0113 1.0213 0.9992 1.0086 1.0118 1.0017 0.9977 1.0046 1.0156 1.0030 1.0029 0.9942 0.9671 1.0337 0.9998 0.9968 1.0061 0.9945 0.9911 0.9898
dispcorr: -0.022753831 hartree
energy: -852.133904876822
dipole: 15.55182 -14.64031 0.91150 0.62013 -2.28561 -1.66548 0.05496 0.00030 0.05525
magnitude: 1.89940 au
magnitude: 4.82789 debye
