program: Orca
programVersion: 5.0.2
elementType: O O C C C C C C C C C C C C C C C C C C H H H H H H H H H H H H H H H H H H H H H H H H H H
charge: 0
multiplicity: 1
keywords: wb97x-d3
keywords: def2-TZVPP
keywords: def2/J RIJCOSX
keywords: DEFGRID2
keywords: scfconv7
keywords: smallprint printgap noloewdin
keywords: NOSOSCF
formula: C18H26O2
InChI: InChI=1/C18H26O2/c1-13(2)18-10-9-17(4,20-18)16(11-18)19-12-15-8-6-5-7-14(15)3/h5-8,13,16H,9-12H2,1-4H3
46 atoms
O  1.775897 0.908802 -0.890976
O  -0.311057 -0.269018 0.833387
C  2.705452 1.05234 0.187156
C  1.539633 -0.495262 -0.781605
C  1.051266 -0.616897 0.68015
C  1.923068 0.447138 1.367755
C  3.801057 0.048308 -0.207361
C  2.963847 -1.080205 -0.833673
C  3.165538 2.495441 0.328074
C  0.617446 -0.981206 -1.869778
C  2.015973 3.484381 0.49134
C  4.152961 2.63064 1.483193
C  -1.217341 -1.343716 0.755007
C  -2.53489 -0.907575 0.173993
C  -3.545281 -1.86661 0.003026
C  -2.770933 0.409595 -0.204445
C  -4.759686 -1.474386 -0.549907
C  -3.321897 -3.296548 0.396493
C  -3.991672 0.785762 -0.751988
C  -4.989693 -0.158114 -0.928425
H  1.229847 -1.622271 1.075744
H  1.288087 1.189089 1.855351
H  2.576623 0.023785 2.129577
H  4.39401 -0.278504 0.645979
H  4.483429 0.493674 -0.934303
H  3.256771 -1.27274 -1.866828
H  3.037352 -2.025178 -0.294024
H  3.697141 2.747501 -0.597191
H  0.471979 -2.058337 -1.791226
H  -0.361911 -0.503342 -1.835366
H  1.052746 -0.783004 -2.849846
H  1.466653 3.320995 1.420308
H  2.403035 4.5037 0.523912
H  1.302866 3.43544 -0.331386
H  5.01631 1.974309 1.367254
H  3.682045 2.397974 2.440736
H  4.528802 3.652764 1.546222
H  -1.377774 -1.76867 1.756539
H  -0.814854 -2.161362 0.146056
H  -1.99865 1.156618 -0.081746
H  -5.53795 -2.215764 -0.688195
H  -4.204522 -3.901745 0.19592
H  -2.486204 -3.740843 -0.149252
H  -3.089556 -3.393354 1.459455
H  -4.155139 1.815785 -1.041621
H  -5.942219 0.123174 -1.358705
elementType: O C H
totalener: -852.11099882 hartree
nucrepener: 1644.35680230 hartree
electener: -2496.46780112 hartree
oneelecener: -4423.53184988 hartree
twoeener: 1927.06404876 hartree
cpcmener: -0.02637494 hartree
kineticenergy: 848.05777106 hartree
xcener: -85.353759415240 hartree
chargesum: -0.0000000
charge: -0.440035 -0.411754 0.326157 0.330549 0.124423 -0.278001 -0.216145 -0.212097 0.025344 -0.329638 -0.301329 -0.316283 0.008298 0.082931 -0.112640 -0.222112 -0.124014 -0.241243 -0.166639 -0.184630 0.088078 0.092343 0.104192 0.085687 0.091131 0.083341 0.089773 0.035885 0.104587 0.097185 0.100616 0.081979 0.097595 0.091411 0.097721 0.087547 0.097013 0.123950 0.107314 0.141041 0.140610 0.092223 0.105175 0.105640 0.158318 0.158503
qa: -0.4400 -0.4118 0.3262 0.3305 0.1244 -0.2780 -0.2161 -0.2121 0.0253 -0.3296 -0.3013 -0.3163 0.0083 0.0829 -0.1126 -0.2221 -0.1240 -0.2412 -0.1666 -0.1846 0.0881 0.0923 0.1042 0.0857 0.0911 0.0833 0.0898 0.0359 0.1046 0.0972 0.1006 0.0820 0.0976 0.0914 0.0977 0.0875 0.0970 0.1240 0.1073 0.1410 0.1406 0.0922 0.1052 0.1056 0.1583 0.1585
va: 1.9997 1.9270 3.7365 3.7162 3.8682 4.0561 3.9786 3.9808 3.7422 3.8989 3.9374 3.9521 3.9237 3.4422 3.8524 3.9031 3.8423 3.9207 3.9143 3.9119 1.0078 1.0354 1.0113 1.0140 1.0133 1.0152 1.0114 1.0237 0.9997 1.0084 1.0120 1.0017 1.0033 1.0164 1.0009 0.9987 1.0040 0.9937 0.9698 1.0272 0.9998 1.0063 0.9945 0.9960 0.9911 0.9898
dispcorr: -0.023048507 hartree
energy: -852.134047330564
dipole: 13.16112 -12.25493 0.90619 0.96671 -2.56119 -1.59447 2.68780 -2.13579 0.55200
magnitude: 1.91527 au
magnitude: 4.86822 debye
