program: Orca
programVersion: 5.0.2
elementType: O O C C C C C C C C C C C C C C C C C C H H H H H H H H H H H H H H H H H H H H H H H H H H
charge: 0
multiplicity: 1
keywords: wb97x-d3
keywords: def2-TZVPP
keywords: def2/J RIJCOSX
keywords: DEFGRID2
keywords: scfconv7
keywords: smallprint printgap noloewdin
keywords: NOSOSCF
formula: C18H26O2
InChI: InChI=1/C18H26O2/c1-13(2)18-10-9-17(4,20-18)16(11-18)19-12-15-8-6-5-7-14(15)3/h5-8,13,16H,9-12H2,1-4H3
46 atoms
O  2.253918 0.243073 -1.063601
O  -0.342489 -0.687094 0.037522
C  2.53343 1.130812 0.023363
C  2.03118 -0.947783 -0.30914
C  0.912425 -0.519304 0.657898
C  1.276347 0.95918 0.89826
C  3.696295 0.419619 0.737889
C  3.324245 -1.058176 0.519012
C  2.778269 2.547532 -0.474273
C  1.737917 -2.13161 -1.194153
C  3.029202 3.489925 0.698717
C  3.914009 2.641875 -1.487966
C  -1.424754 -0.51996 0.915612
C  -2.727812 -0.743814 0.200088
C  -3.915867 -0.738864 0.946946
C  -2.784955 -0.94044 -1.175582
C  -5.125078 -0.937547 0.289026
C  -3.889865 -0.52525 2.431354
C  -4.001565 -1.135097 -1.817755
C  -5.176668 -1.13567 -1.084586
H  0.944158 -1.11277 1.579842
H  0.475221 1.614471 0.544502
H  1.455514 1.191462 1.947196
H  3.759206 0.695466 1.790057
H  4.656622 0.657518 0.279106
H  4.090434 -1.582196 -0.054433
H  3.175039 -1.61341 1.445354
H  1.855469 2.871265 -0.970202
H  1.525282 -3.008559 -0.583113
H  0.882211 -1.965221 -1.847178
H  2.599563 -2.368784 -1.817847
H  2.203388 3.490679 1.411275
H  3.938272 3.222657 1.241749
H  3.152254 4.514443 0.344848
H  4.876767 2.381419 -1.045148
H  3.998925 3.663073 -1.860923
H  3.757205 1.994785 -2.350436
H  -1.424285 0.487167 1.358503
H  -1.33878 -1.219918 1.759774
H  -1.877628 -0.942422 -1.763929
H  -6.042935 -0.936372 0.865106
H  -3.322863 -1.306564 2.942565
H  -3.422739 0.425738 2.696649
H  -4.896991 -0.524935 2.845527
H  -4.025191 -1.285538 -2.889339
H  -6.129664 -1.288185 -1.574573
elementType: O C H
totalener: -852.11294680 hartree
nucrepener: 1621.44360180 hartree
electener: -2473.55654859 hartree
oneelecener: -4377.54897515 hartree
twoeener: 1903.99242656 hartree
cpcmener: -0.02593035 hartree
kineticenergy: 848.06213222 hartree
xcener: -85.354278073539 hartree
chargesum: 0.0000000
charge: -0.439199 -0.374556 0.342220 0.351734 0.053902 -0.273898 -0.254649 -0.200449 0.030134 -0.306557 -0.319534 -0.300186 0.057353 0.071062 -0.103531 -0.222773 -0.129420 -0.246257 -0.184091 -0.175838 0.082590 0.097256 0.098398 0.089088 0.103289 0.086972 0.085787 0.036400 0.100603 0.089788 0.096994 0.098356 0.088279 0.097498 0.080857 0.096714 0.091488 0.100160 0.095636 0.147294 0.140555 0.107487 0.104028 0.092241 0.157678 0.159097
qa: -0.4392 -0.3746 0.3422 0.3517 0.0539 -0.2739 -0.2546 -0.2004 0.0301 -0.3066 -0.3195 -0.3002 0.0574 0.0711 -0.1035 -0.2228 -0.1294 -0.2463 -0.1841 -0.1758 0.0826 0.0973 0.0984 0.0891 0.1033 0.0870 0.0858 0.0364 0.1006 0.0898 0.0970 0.0984 0.0883 0.0975 0.0809 0.0967 0.0915 0.1002 0.0956 0.1473 0.1406 0.1075 0.1040 0.0922 0.1577 0.1591
va: 2.0146 1.9593 3.7274 3.7077 4.0010 3.9413 4.0202 3.9617 3.7342 3.9206 3.9533 3.9347 3.8714 3.5028 3.8530 3.9403 3.8493 3.9359 3.9230 3.9017 1.0150 1.0218 1.0104 1.0117 1.0059 1.0138 1.0151 1.0245 1.0010 1.0092 1.0075 1.0005 0.9980 1.0038 1.0033 1.0032 1.0171 0.9801 0.9909 1.0183 1.0001 0.9950 0.9945 1.0064 0.9923 0.9895
dispcorr: -0.021919008 hartree
energy: -852.134865803991
dipole: 13.99480 -13.65161 0.34319 7.61483 -7.47002 0.14481 5.95875 -4.00871 1.95004
magnitude: 1.98530 au
magnitude: 5.04622 debye
