program: Orca
programVersion: 5.0.2
elementType: O O C C C C C C C C C C C C C C C C C C H H H H H H H H H H H H H H H H H H H H H H H H H H
charge: 0
multiplicity: 1
keywords: wb97x-d3
keywords: def2-TZVPP
keywords: def2/J RIJCOSX
keywords: DEFGRID2
keywords: scfconv7
keywords: smallprint printgap noloewdin
keywords: NOSOSCF
formula: C18H26O2
InChI: InChI=1/C18H26O2/c1-13(2)18-10-9-17(4,20-18)16(11-18)19-12-15-8-6-5-7-14(15)3/h5-8,13,16H,9-12H2,1-4H3
46 atoms
O  2.360007 0.117311 -1.091639
O  -0.252031 -0.712394 0.038479
C  2.669363 1.015665 -0.022254
C  2.110291 -1.054081 -0.316254
C  1.011435 -0.577627 0.651076
C  1.420477 0.893393 0.872272
C  3.822425 0.282263 0.686624
C  3.406361 -1.187458 0.504997
C  3.014078 2.400881 -0.548965
C  1.777073 -2.244759 -1.178008
C  1.925485 3.006162 -1.429282
C  3.352014 3.341012 0.603799
C  -1.320916 -0.513069 0.926448
C  -2.638894 -0.672936 0.220828
C  -3.816428 -0.651247 0.983887
C  -2.720345 -0.823216 -1.159513
C  -5.040311 -0.786399 0.337039
C  -3.764288 -0.486853 2.473997
C  -3.951313 -0.955603 -1.790359
C  -5.116241 -0.938972 -1.041188
H  1.029196 -1.160871 1.579808
H  0.624391 1.562538 0.537262
H  1.629738 1.127136 1.915391
H  3.921425 0.575764 1.731019
H  4.772656 0.495401 0.192441
H  4.151608 -1.748689 -0.060802
H  3.246454 -1.716013 1.445101
H  3.91651 2.286583 -1.161506
H  1.541103 -3.102741 -0.548167
H  0.923339 -2.065851 -1.830684
H  2.628711 -2.520411 -1.800049
H  1.008374 3.199562 -0.869802
H  2.26151 3.962384 -1.832573
H  1.672333 2.369668 -2.276968
H  4.165569 2.959751 1.222277
H  2.488431 3.506542 1.251294
H  3.663768 4.314367 0.222625
H  -1.275883 0.487264 1.381933
H  -1.256274 -1.22671 1.760821
H  -1.820543 -0.83653 -1.759364
H  -5.950073 -0.771828 0.925654
H  -3.254357 0.434455 2.763843
H  -4.765628 -0.457644 2.900931
H  -3.225332 -1.307674 2.952624
H  -3.994549 -1.070671 -2.865763
H  -6.080162 -1.04266 -1.522519
elementType: O C H
totalener: -852.11309038 hartree
nucrepener: 1629.47600911 hartree
electener: -2481.58909949 hartree
oneelecener: -4393.65137111 hartree
twoeener: 1912.06227162 hartree
cpcmener: -0.02603415 hartree
kineticenergy: 848.05578320 hartree
xcener: -85.353080559950 hartree
chargesum: 0.0000000
charge: -0.439257 -0.377648 0.350641 0.343377 0.072503 -0.323570 -0.219191 -0.205438 0.029594 -0.307064 -0.301753 -0.317227 0.057468 0.070395 -0.102574 -0.223639 -0.128836 -0.247316 -0.182042 -0.175804 0.081963 0.110433 0.102659 0.086027 0.091405 0.088203 0.085465 0.036845 0.100744 0.090130 0.096804 0.079959 0.097546 0.091899 0.098123 0.088523 0.097211 0.100148 0.097459 0.144381 0.140546 0.103773 0.092382 0.107872 0.157979 0.158902
qa: -0.4393 -0.3776 0.3506 0.3434 0.0725 -0.3236 -0.2192 -0.2054 0.0296 -0.3071 -0.3018 -0.3172 0.0575 0.0704 -0.1026 -0.2236 -0.1288 -0.2473 -0.1820 -0.1758 0.0820 0.1104 0.1027 0.0860 0.0914 0.0882 0.0855 0.0368 0.1007 0.0901 0.0968 0.0800 0.0975 0.0919 0.0981 0.0885 0.0972 0.1001 0.0975 0.1444 0.1405 0.1038 0.0924 0.1079 0.1580 0.1589
va: 2.0173 1.9577 3.7159 3.7203 3.9737 4.0070 3.9853 3.9677 3.7341 3.9225 3.9403 3.9526 3.8672 3.5069 3.8503 3.9418 3.8493 3.9361 3.9200 3.9028 1.0142 1.0084 1.0116 1.0121 1.0138 1.0124 1.0150 1.0236 1.0008 1.0093 1.0076 1.0023 1.0034 1.0168 1.0008 0.9976 1.0039 0.9800 0.9914 1.0205 1.0001 0.9945 1.0063 0.9950 0.9920 0.9895
dispcorr: -0.022062646 hartree
energy: -852.135153023780
dipole: 11.35609 -10.94348 0.41261 7.79062 -7.66168 0.12894 5.96242 -4.01492 1.94750
magnitude: 1.99490 au
magnitude: 5.07063 debye
