program: Orca
programVersion: 5.0.2
elementType: O O C C C C C C C C C C C C C C C C C C H H H H H H H H H H H H H H H H H H H H H H H H H H
charge: 0
multiplicity: 1
keywords: wb97x-d3
keywords: def2-TZVPP
keywords: def2/J RIJCOSX
keywords: DEFGRID2
keywords: scfconv7
keywords: smallprint printgap noloewdin
keywords: NOSOSCF
formula: C18H26O2
InChI: InChI=1/C18H26O2/c1-13(2)18-10-9-17(4,20-18)16(11-18)19-12-15-8-6-5-7-14(15)3/h5-8,13,16H,9-12H2,1-4H3
46 atoms
O  2.108925 -0.090936 -1.124208
O  -0.277464 -0.820115 0.450484
C  2.530091 0.949768 -0.236644
C  2.023153 -1.153825 -0.173588
C  1.047756 -0.577986 0.86761
C  1.432353 0.915635 0.842318
C  3.803963 0.347409 0.380475
C  3.425063 -1.141599 0.462853
C  2.723613 2.263953 -0.978185
C  1.628047 -2.456092 -0.820629
C  1.483527 2.715732 -1.743827
C  3.185083 3.353655 -0.015366
C  -1.248209 -0.388979 1.383658
C  -2.61012 -0.674723 0.823462
C  -3.11582 0.066541 -0.255313
C  -3.370354 -1.702609 1.370156
C  -4.378435 -0.254544 -0.746411
C  -2.334154 1.187998 -0.877021
C  -4.629189 -2.010422 0.871883
C  -5.132561 -1.281939 -0.193821
H  1.209618 -1.032305 1.853396
H  0.575826 1.527282 0.550654
H  1.78173 1.282548 1.806806
H  4.040939 0.784841 1.349603
H  4.663329 0.508351 -0.273864
H  4.107519 -1.762258 -0.119583
H  3.418334 -1.532824 1.480508
H  3.526949 2.100807 -1.706327
H  0.688095 -2.384149 -1.366387
H  2.399505 -2.787943 -1.516568
H  1.517059 -3.231009 -0.061564
H  0.644923 2.925974 -1.077127
H  1.696708 3.636422 -2.28938
H  1.153262 1.977125 -2.474163
H  4.102885 3.080736 0.506826
H  2.424461 3.570784 0.737509
H  3.382816 4.281011 -0.55464
H  -1.142183 0.682548 1.595609
H  -1.116864 -0.913115 2.339161
H  -2.969703 -2.269185 2.202509
H  -4.781035 0.314303 -1.576106
H  -1.41904 0.833419 -1.352368
H  -2.924395 1.697473 -1.637148
H  -2.039142 1.933013 -0.13537
H  -5.207596 -2.811847 1.312506
H  -6.111755 -1.507681 -0.596201
elementType: O C H
totalener: -852.11321479 hartree
nucrepener: 1656.39720587 hartree
electener: -2508.51042066 hartree
oneelecener: -4447.69171574 hartree
twoeener: 1939.18129508 hartree
cpcmener: -0.02666317 hartree
kineticenergy: 848.07034878 hartree
xcener: -85.352590956391 hartree
chargesum: 0.0000000
charge: -0.439690 -0.384819 0.359713 0.313878 0.101105 -0.329841 -0.221937 -0.199484 0.041648 -0.303022 -0.314764 -0.318634 0.016775 -0.061159 -0.031828 -0.130756 -0.149462 -0.237068 -0.187661 -0.158492 0.086220 0.104730 0.104879 0.086083 0.091066 0.087239 0.087083 0.036494 0.088671 0.096007 0.099799 0.077993 0.101782 0.094971 0.097980 0.089068 0.096997 0.118759 0.095216 0.141189 0.140318 0.092172 0.099359 0.102449 0.159258 0.159714
qa: -0.4397 -0.3848 0.3597 0.3139 0.1011 -0.3298 -0.2219 -0.1995 0.0416 -0.3030 -0.3148 -0.3186 0.0168 -0.0612 -0.0318 -0.1308 -0.1495 -0.2371 -0.1877 -0.1585 0.0862 0.1047 0.1049 0.0861 0.0911 0.0872 0.0871 0.0365 0.0887 0.0960 0.0998 0.0780 0.1018 0.0950 0.0980 0.0891 0.0970 0.1188 0.0952 0.1412 0.1403 0.0922 0.0994 0.1024 0.1593 0.1597
va: 2.0143 1.9243 3.6978 3.7446 3.9342 4.0062 3.9862 3.9670 3.7197 3.9163 3.9405 3.9537 3.8724 3.6576 3.6935 3.8912 3.8847 3.8715 3.9104 3.8979 1.0154 1.0035 1.0147 1.0116 1.0139 1.0139 1.0152 1.0237 1.0160 1.0074 1.0010 1.0003 1.0065 1.0133 1.0010 0.9975 1.0042 0.9795 1.0064 1.0026 1.0020 1.0177 1.0106 0.9976 0.9912 0.9895
dispcorr: -0.023705345 hartree
energy: -852.136920135263
dipole: 12.75736 -12.17135 0.58600 10.36684 -9.81451 0.55233 -0.92849 2.36583 1.43734
magnitude: 1.64755 au
magnitude: 4.18773 debye
