program: Orca
programVersion: 5.0.2
elementType: O O C C C C C C C C C C C C C C C C C C H H H H H H H H H H H H H H H H H H H H H H H H H H
charge: 0
multiplicity: 1
keywords: wb97x-d3
keywords: def2-TZVPP
keywords: def2/J RIJCOSX
keywords: DEFGRID2
keywords: scfconv7
keywords: smallprint printgap noloewdin
keywords: NOSOSCF
formula: C18H26O2
InChI: InChI=1/C18H26O2/c1-13(2)18-10-9-17(4,20-18)16(11-18)19-12-15-8-6-5-7-14(15)3/h5-8,13,16H,9-12H2,1-4H3
46 atoms
O  2.513076 -0.02162 -0.717023
O  -0.213721 -1.193501 -0.859654
C  2.067751 1.192757 -0.110743
C  1.968374 -0.941362 0.225749
C  0.469312 -0.57152 0.209988
C  0.549728 0.950389 -0.00169
C  2.657891 1.084798 1.307448
C  2.54932 -0.430569 1.55897
C  2.464427 2.399531 -0.948506
C  2.312581 -2.366795 -0.115864
C  1.970925 3.689041 -0.300401
C  3.962826 2.475686 -1.224316
C  -1.247508 -2.078986 -0.48043
C  -2.435385 -1.365686 0.112298
C  -3.234588 -0.516512 -0.669178
C  -2.724425 -1.525615 1.463516
C  -4.297043 0.14431 -0.059085
C  -2.973017 -0.315528 -2.133174
C  -3.78589 -0.858407 2.06034
C  -4.573515 -0.016658 1.292585
H  0.00215 -0.831333 1.16476
H  0.04946 1.223956 -0.934214
H  0.081499 1.516362 0.803396
H  2.103656 1.681684 2.031714
H  3.696588 1.417164 1.336432
H  3.528851 -0.877136 1.73916
H  1.916719 -0.685784 2.410416
H  1.95281 2.293649 -1.912957
H  1.939867 -2.659171 -1.097178
H  3.393198 -2.516616 -0.104671
H  1.88162 -3.043789 0.623059
H  0.892976 3.679881 -0.130997
H  2.457291 3.869027 0.66098
H  2.189057 4.546752 -0.938816
H  4.180839 3.32159 -1.878307
H  4.339065 1.579773 -1.718097
H  4.541275 2.622007 -0.31004
H  -0.882495 -2.832549 0.228331
H  -1.531611 -2.615446 -1.389333
H  -2.104649 -2.185454 2.060238
H  -4.923489 0.797859 -0.655203
H  -3.757361 0.285655 -2.591022
H  -2.023741 0.189743 -2.313254
H  -2.931966 -1.264462 -2.671565
H  -3.990837 -0.994931 3.114507
H  -5.40567 0.512835 1.739272
elementType: O C H
totalener: -852.12162216 hartree
nucrepener: 1662.33325425 hartree
electener: -2514.45487641 hartree
oneelecener: -4459.22439211 hartree
twoeener: 1944.76951570 hartree
cpcmener: -0.02011815 hartree
kineticenergy: 848.05757269 hartree
xcener: -85.349091389099 hartree
chargesum: 0.0000000
charge: -0.417610 -0.391879 0.343191 0.375240 0.048422 -0.252848 -0.251731 -0.223227 0.020212 -0.321496 -0.315583 -0.297486 0.062086 0.040004 -0.141401 -0.164384 -0.115891 -0.243931 -0.174393 -0.168882 0.079931 0.086599 0.094601 0.087338 0.100218 0.085148 0.087201 0.035771 0.090262 0.098377 0.095910 0.097576 0.085848 0.096899 0.094878 0.093490 0.078489 0.101907 0.118406 0.140120 0.136720 0.090970 0.099839 0.103936 0.155207 0.155946
qa: -0.4176 -0.3919 0.3432 0.3752 0.0484 -0.2528 -0.2517 -0.2232 0.0202 -0.3215 -0.3156 -0.2975 0.0621 0.0400 -0.1414 -0.1644 -0.1159 -0.2439 -0.1744 -0.1689 0.0799 0.0866 0.0946 0.0873 0.1002 0.0851 0.0872 0.0358 0.0903 0.0984 0.0959 0.0976 0.0858 0.0969 0.0949 0.0935 0.0785 0.1019 0.1184 0.1401 0.1367 0.0910 0.0998 0.1039 0.1552 0.1559
va: 2.0401 1.9069 3.7473 3.7158 4.0436 3.9943 4.0129 3.9708 3.7426 3.8936 3.9505 3.9360 3.8216 3.4963 3.8126 3.8739 3.8496 3.9195 3.9194 3.9176 1.0070 1.0322 1.0112 1.0131 1.0071 1.0151 1.0101 1.0230 1.0200 1.0089 1.0016 1.0016 0.9984 1.0043 1.0033 1.0169 1.0041 0.9949 0.9902 1.0018 1.0000 1.0062 1.0049 0.9966 0.9921 0.9904
dispcorr: -0.023705336 hartree
energy: -852.145327494480
dipole: 11.19268 -11.74831 -0.55562 8.36064 -8.27101 0.08963 -0.73892 1.87928 1.14036
magnitude: 1.27168 au
magnitude: 3.23235 debye
