program: Orca
programVersion: 5.0.2
elementType: O O C C C C C C C C C C C C C C C C C C H H H H H H H H H H H H H H H H H H H H H H H H H H
charge: 0
multiplicity: 1
keywords: wb97x-d3
keywords: def2-TZVPP
keywords: def2/J RIJCOSX
keywords: DEFGRID2
keywords: scfconv7
keywords: smallprint printgap noloewdin
keywords: NOSOSCF
formula: C18H26O2
InChI: InChI=1/C18H26O2/c1-13(2)18-10-9-17(4,20-18)16(11-18)19-12-15-8-6-5-7-14(15)3/h5-8,13,16H,9-12H2,1-4H3
46 atoms
O  2.061992 0.048145 -0.830518
O  -0.836025 0.822205 -0.809902
C  2.458495 1.145751 -0.006932
C  1.058537 -0.504307 0.019942
C  0.110136 0.695971 0.232234
C  1.115358 1.865079 0.218512
C  2.839215 0.447099 1.312384
C  1.825618 -0.711279 1.339375
C  3.530173 1.98439 -0.689167
C  0.459475 -1.756582 -0.562377
C  3.929313 3.164644 0.191785
C  4.760004 1.176344 -1.090375
C  -2.17914 0.981203 -0.391543
C  -2.787466 -0.294757 0.129032
C  -3.151191 -1.330103 -0.745107
C  -2.946152 -0.47004 1.499813
C  -3.645703 -2.51449 -0.206875
C  -3.041488 -1.175763 -2.234232
C  -3.442841 -1.655578 2.024918
C  -3.788726 -2.684409 1.164272
H  -0.398233 0.605933 1.196601
H  0.894611 2.534612 -0.616736
H  1.093903 2.456649 1.133766
H  2.753009 1.113736 2.17035
H  3.864537 0.075428 1.29133
H  2.327267 -1.68059 1.333141
H  1.166147 -0.695489 2.208238
H  3.081062 2.388374 -1.604632
H  1.224259 -2.52535 -0.686905
H  -0.29875 -2.157864 0.111144
H  -0.007038 -1.585852 -1.531978
H  4.657084 3.796188 -0.32051
H  3.077113 3.796606 0.446452
H  4.389578 2.833532 1.125404
H  5.287815 0.776278 -0.222659
H  5.466506 1.810538 -1.628669
H  4.51247 0.340572 -1.745013
H  -2.726813 1.34196 -1.265092
H  -2.257062 1.763618 0.37335
H  -2.677803 0.338988 2.169971
H  -3.927306 -3.320882 -0.874161
H  -3.786293 -0.473066 -2.61599
H  -2.066066 -0.802051 -2.544214
H  -3.206917 -2.127115 -2.73889
H  -3.555791 -1.771675 3.095274
H  -4.174527 -3.617838 1.554522
elementType: O C H
totalener: -852.12053986 hartree
nucrepener: 1668.90382705 hartree
electener: -2521.02436690 hartree
oneelecener: -4472.44345237 hartree
twoeener: 1951.41908547 hartree
cpcmener: -0.01972140 hartree
kineticenergy: 848.05262337 hartree
xcener: -85.349308550601 hartree
chargesum: 0.0000000
charge: -0.420398 -0.388371 0.328761 0.415447 0.058121 -0.251341 -0.247737 -0.223291 0.018810 -0.353694 -0.316855 -0.297837 0.047230 0.004589 -0.102564 -0.145483 -0.125323 -0.253880 -0.186819 -0.157837 0.079519 0.078098 0.093660 0.088051 0.100392 0.084008 0.085397 0.035959 0.103156 0.089981 0.102694 0.096657 0.096073 0.087326 0.078768 0.095017 0.093165 0.114332 0.102398 0.142550 0.136736 0.111441 0.098040 0.094132 0.155217 0.155706
qa: -0.4204 -0.3884 0.3288 0.4154 0.0581 -0.2513 -0.2477 -0.2233 0.0188 -0.3537 -0.3169 -0.2978 0.0472 0.0046 -0.1026 -0.1455 -0.1253 -0.2539 -0.1868 -0.1578 0.0795 0.0781 0.0937 0.0881 0.1004 0.0840 0.0854 0.0360 0.1032 0.0900 0.1027 0.0967 0.0961 0.0873 0.0788 0.0950 0.0932 0.1143 0.1024 0.1426 0.1367 0.1114 0.0980 0.0941 0.1552 0.1557
va: 2.0365 1.9212 3.7487 3.5762 4.0306 4.0728 4.0071 3.9718 3.7444 3.9399 3.9510 3.9357 3.8762 3.4485 3.7612 3.8593 3.8713 3.9118 3.9286 3.9114 1.0057 1.0425 1.0116 1.0132 1.0072 1.0146 1.0104 1.0234 1.0118 0.9970 1.0058 1.0042 1.0023 0.9980 1.0038 1.0032 1.0172 0.9896 0.9952 0.9996 1.0000 0.9934 1.0079 1.0049 0.9921 0.9901
dispcorr: -0.024679660 hartree
energy: -852.145219516122
dipole: 13.85189 -14.27654 -0.42465 4.94825 -4.63975 0.30849 -0.20399 1.41076 1.20678
magnitude: 1.31598 au
magnitude: 3.34496 debye
