program: Orca
programVersion: 5.0.2
elementType: O O C C C C C C C C C C C C C C C C C C H H H H H H H H H H H H H H H H H H H H H H H H H H
charge: 0
multiplicity: 1
keywords: wb97x-d3
keywords: def2-TZVPP
keywords: def2/J RIJCOSX
keywords: DEFGRID2
keywords: scfconv7
keywords: smallprint printgap noloewdin
keywords: NOSOSCF
formula: C18H26O2
InChI: InChI=1/C18H26O2/c1-13(2)18-10-9-17(4,20-18)16(11-18)19-12-15-8-6-5-7-14(15)3/h5-8,13,16H,9-12H2,1-4H3
46 atoms
O  2.093369 -0.026554 -0.880374
O  -0.746974 0.894404 -0.609153
C  2.589309 0.938993 0.048889
C  1.098625 -0.626784 -0.052446
C  0.235582 0.586103 0.357892
C  1.305585 1.694632 0.437776
C  2.991158 0.054996 1.244125
C  1.911193 -1.038606 1.189921
C  3.722024 1.754249 -0.558445
C  0.398326 -1.760566 -0.752593
C  3.338395 2.457222 -1.856535
C  4.264371 2.759216 0.453431
C  -2.059938 1.061347 -0.105947
C  -2.713015 -0.24388 0.266564
C  -3.187225 -1.121287 -0.720346
C  -2.795306 -0.612736 1.605408
C  -3.712873 -2.348046 -0.325618
C  -3.156015 -0.756747 -2.176341
C  -3.322907 -1.839112 1.986957
C  -3.777793 -2.712951 1.013028
H  -0.232373 0.402554 1.329292
H  1.071902 2.481181 -0.282115
H  1.368288 2.157233 1.423041
H  3.000504 0.604311 2.185469
H  3.99065 -0.360582 1.096125
H  2.349153 -2.027476 1.043189
H  1.294871 -1.089678 2.088729
H  4.526914 1.045271 -0.787374
H  -0.347559 -2.204493 -0.092015
H  -0.106115 -1.441892 -1.664219
H  1.10977 -2.545112 -1.016339
H  2.568906 3.21611 -1.700953
H  4.208017 2.966206 -2.277102
H  2.973972 1.761973 -2.613316
H  5.123329 3.291326 0.041084
H  4.594927 2.280304 1.376278
H  3.515066 3.509041 0.717045
H  -2.623377 1.566132 -0.89371
H  -2.061127 1.734002 0.760633
H  -2.440398 0.074554 2.365219
H  -4.080345 -3.032701 -1.081264
H  -3.414134 -1.613035 -2.798659
H  -3.873218 0.03567 -2.40316
H  -2.177448 -0.399698 -2.4963
H  -3.374483 -2.107447 3.034413
H  -4.189537 -3.675233 1.29026
elementType: O C H
totalener: -852.12060841 hartree
nucrepener: 1673.68302208 hartree
electener: -2525.80363049 hartree
oneelecener: -4482.03436752 hartree
twoeener: 1956.23073703 hartree
cpcmener: -0.01981202 hartree
kineticenergy: 848.05332298 hartree
xcener: -85.349504268145 hartree
chargesum: -0.0000000
charge: -0.419473 -0.389361 0.335215 0.407531 0.067968 -0.291835 -0.211915 -0.231548 0.017319 -0.350446 -0.297086 -0.316010 0.043237 0.008909 -0.102633 -0.147433 -0.128522 -0.248828 -0.186243 -0.157610 0.082018 0.088469 0.097264 0.083709 0.090210 0.085196 0.085203 0.034983 0.089479 0.102582 0.102888 0.079663 0.095288 0.093384 0.096877 0.096389 0.086617 0.113354 0.103400 0.142563 0.136772 0.093355 0.110977 0.096434 0.155341 0.156351
qa: -0.4195 -0.3894 0.3352 0.4075 0.0680 -0.2918 -0.2119 -0.2315 0.0173 -0.3504 -0.2971 -0.3160 0.0432 0.0089 -0.1026 -0.1474 -0.1285 -0.2488 -0.1862 -0.1576 0.0820 0.0885 0.0973 0.0837 0.0902 0.0852 0.0852 0.0350 0.0895 0.1026 0.1029 0.0797 0.0953 0.0934 0.0969 0.0964 0.0866 0.1134 0.1034 0.1426 0.1368 0.0934 0.1110 0.0964 0.1553 0.1564
va: 2.0404 1.9245 3.7436 3.5861 4.0132 4.1067 3.9710 3.9808 3.7460 3.9407 3.9383 3.9511 3.8828 3.4445 3.7684 3.8599 3.8740 3.9138 3.9294 3.9120 1.0049 1.0366 1.0126 1.0134 1.0144 1.0134 1.0100 1.0243 0.9971 1.0060 1.0122 1.0022 1.0030 1.0171 1.0041 1.0010 0.9989 0.9903 0.9949 0.9996 1.0000 1.0049 0.9936 1.0077 0.9922 0.9899
dispcorr: -0.024776661 hartree
energy: -852.145385068049
dipole: 12.01139 -12.32893 -0.31754 6.27610 -6.13627 0.13984 -1.24890 2.52311 1.27421
magnitude: 1.32061 au
magnitude: 3.35671 debye
